Recordsnpmajv6.15.0ajv.Ajv
Compatibility matrix
Project-level observations and symbol/contract verifications are counted separately and never combined.
These counts do not distinguish how the symbol was called: overloads, argument shapes and options are pooled together. What a particular call shape does is proven by a sample's contract, not by these numbers.
| Environment | Confidence | Observations | Verified | Pass rate | Peers | Last seen |
|---|---|---|---|---|---|---|
| node 24.13 · JS · pnpm · windows
Observations: PROJECT_COMPILE 1✓ 7✕ · PROJECT_TEST 11✓ 2✕ — Verified: UNKNOWN 0✓ 6✕
|
ELEVATED FAILURE | 21 | 6 | 44% | 1 | 2026-09-16 |
snapshot · 2026-09-16
Failure clusters
-
observed UNKNOWN exit 1 ERR_PNPM_RECURSIVE_RUN_FIRST_FAIL Evidence gap ×62 6.15.0 → 8.20.0 executionContext=node · moduleSystem=esm · os=windows · runtime=node@24.13 ajv.Ajv sha256:9f91c9753081…(node:<n>) ExperimentalWarning: SQLite is an experimental feature and might change at any time …pnpm · unclassified-diagnostic · outer pnpm · gap stage-unknownEvidence quality: complete · Environment variants: 1 · First recorded: 2026-09-01 · Last seen: 2026-09-14Diagnostic re-verification candidate
-
observed UNKNOWN exit 1 ERR_PNPM_RECURSIVE_EXEC_FIRST_FAIL Evidence gap ×56 6.15.0 → 8.20.0 executionContext=node · moduleSystem=esm · os=windows · runtime=node@24.13 ajv.Ajv sha256:979755e6489d…(node:<n>) ExperimentalWarning: SQLite is an experimental feature and might change at any time …pnpm · unclassified-diagnostic · outer pnpm · gap stage-unknownEvidence quality: complete · Environment variants: 1 · First recorded: 2026-09-01 · Last seen: 2026-09-14Diagnostic re-verification candidate
-
observed UNKNOWN exit 1 Evidence gap ×22 6.15.0 → 8.17.1 → 8.20.0 executionContext=node · moduleSystem=cjs · os=linux · runtime=node@22.23 sha256:9be950af9140…Traceback (most recent call last): · File <str>, line 1, in <module> · ModuleNotFoundError: No module named <str>python3 · unclassified-diagnostic · outer python3 · gap stage-unknownEvidence quality: complete · Environment variants: 1 · First recorded: 2026-08-31 · Last seen: 2026-09-02Diagnostic re-verification candidate
-
observed UNKNOWN exit 1 ERR_PNPM_RECURSIVE_EXEC_FIRST_FAIL Evidence gap ×22 6.15.0 → 8.20.0 executionContext=node · moduleSystem=esm · os=windows · runtime=node@24.13 sha256:73873d2c4aed…<str> is not recognized as an internal or external command, · operable program or batch file. · undefined …pnpm · unclassified-diagnostic · outer pnpm · gap stage-unknownEvidence quality: complete · Environment variants: 1 · First recorded: 2026-09-01 · Last seen: 2026-09-01Diagnostic re-verification candidate
-
observed PROJECT_TEST exit 1 ELIFECYCLE ×20 6.15.0 → 8.20.0 executionContext=node · moduleSystem=esm · os=windows · runtime=node@24.13 ajv.Ajv sha256:7711694d48fa…ELIFECYCLE Test failed. See above for more details.javascript/test-runner · test-runner-diagnostic · outer pnpm testEvidence quality: complete · Environment variants: 1 · First recorded: 2026-08-29 · Last seen: 2026-09-01
-
observed UNKNOWN exit 1 ELIFECYCLE Evidence gap ×14 6.15.0 → 8.20.0 executionContext=node · moduleSystem=esm · os=windows · runtime=node@24.13 sha256:f398b989dbea…> devhotel-workspace@0.4.3 lint <path> · > eslint . · <path> …pnpm · unclassified-diagnostic · outer pnpm · gap stage-unknownEvidence quality: complete · Environment variants: 1 · First recorded: 2026-09-01 · Last seen: 2026-09-01Diagnostic re-verification candidate
-
observed PROJECT_TEST Evidence gap ×10 6.15.0 → 8.20.0 executionContext=node · os=windowsEvidence quality: legacy-evidence-incomplete · Environment variants: 3 · First recorded: 2026-08-21 · Last seen: 2026-08-25Diagnostic re-verification candidate
-
observed UNKNOWN exit 1 ERR_PNPM_RECURSIVE_RUN_FIRST_FAIL Evidence gap ×10 6.15.0 → 8.20.0 executionContext=node · moduleSystem=esm · os=windows · runtime=node@24.13 sha256:0c4a78e30813…> devhotel-workspace@0.5.2 typecheck <path> · > pnpm -r typecheck · Scope: 4 of 5 workspace projects · packages/shared typecheck$ tsc --noEmitpnpm · unclassified-diagnostic · outer pnpm · gap stage-unknownEvidence quality: complete · Environment variants: 1 · First recorded: 2026-09-13 · Last seen: 2026-09-13Diagnostic re-verification candidate
-
observed UNKNOWN exit 1 ERR_ASSERTION Evidence gap ×8 6.15.0 → 8.17.1 → 8.20.0 executionContext=node · os=linux · runtime=node@22.23 sha256:986d98189e70…node:internal/modules/run_main:<n> · triggerUncaughtException( · ^ · AssertionError [ERR_ASSERTION]: Expected values to be strictly equal:node · unclassified-diagnostic · outer node · gap stage-unknownEvidence quality: complete · Environment variants: 2 · First recorded: 2026-08-29 · Last seen: 2026-09-05Diagnostic re-verification candidate
-
observed UNKNOWN exit 1 ERR_PNPM_RECURSIVE_EXEC_FIRST_FAIL Evidence gap ×8 6.15.0 → 8.20.0 executionContext=node · moduleSystem=esm · os=windows · runtime=node@24.13 sha256:d53178e9c23b…<str> is not recognized as an internal or external command, · operable program or batch file. · undefined · <path>pnpm · unclassified-diagnostic · outer pnpm · gap stage-unknownEvidence quality: complete · Environment variants: 1 · First recorded: 2026-08-29 · Last seen: 2026-09-14Diagnostic re-verification candidate
-
observed UNKNOWN exit 1 ERR_PNPM_RECURSIVE_RUN_FIRST_FAIL Evidence gap ×8 6.15.0 → 8.20.0 executionContext=node · moduleSystem=esm · os=windows · runtime=node@24.13 sha256:3b99548df64e…> devhotel-workspace@0.4.3 typecheck <path> · > pnpm -r typecheck · Scope: 4 of 5 workspace projects · packages/shared typecheck$ tsc --noEmitpnpm · unclassified-diagnostic · outer pnpm · gap stage-unknownEvidence quality: complete · Environment variants: 1 · First recorded: 2026-09-01 · Last seen: 2026-09-01Diagnostic re-verification candidate
-
observed PROCESS_START process start failed Evidence gap ×8 6.15.0 → 8.17.1 → 8.20.0 executionContext=node sha256:c12549970456…· structured-termination · gap diagnostic-missingEvidence quality: partial · Environment variants: 2 · First recorded: 2026-09-02 · Last seen: 2026-09-16Diagnostic re-verification candidate
Showing the 12 most-reported of 247 recorded failure clusters. The rest are single reports.