Registrosnpm@types/node22.20.3
Detalhe do ambiente
Observações no nível do projeto e verificações de símbolo/contrato são contadas separadamente e nunca somadas.
Estas contagens não distinguem como o símbolo foi chamado: sobrecargas, formatos de argumentos e opções são agrupados. O que uma forma de chamada específica faz é provado pelo contrato de uma amostra, não por estes números.
| Ambiente | Confiança | Observações | Verificado | Taxa de aprovação | Peers | Visto por último |
|---|---|---|---|---|---|---|
| node 22 · JS · npm · linux glibc · docker
Uso: USED 1✓
|
LOW | 0 +1 | 0 | — | 1 | 2026-09-16 |
| node 22 · JS · npm · linux glibc · docker
Uso: USED 2✓
|
LOW | 0 +2 | 0 | — | 1 | 2026-09-17 |
| node 22.23 · JS · npm · linux glibc
Observações: PROJECT_PROCESS 6✓ — Verificado: UNKNOWN 0✓ 3✕
|
ELEVATED FAILURE | 6 | 3 | 67% | 1 | 2026-09-17 |
| node 22.23 · JS · npm · linux glibc
Observações: PROJECT_PROCESS 11✓ · PROJECT_TEST 1✓ — Verificado: UNKNOWN 0✓ 2✕
|
LOW | 12 | 2 | 86% | 1 | 2026-09-17 |
Clusters de falha recentes
-
observado UNKNOWN exit 13 Lacuna de evidência ×1 22.20.3 executionContext=node · moduleSystem=esm · os=linux · runtime=node@22.23 sha256:4a939d00eec4…Warning: Detected unsettled top-level await at <url>]:<n> · const ans = await promptPromise; · ^ · fil<path>:<n>node · unclassified-diagnostic · outer node · gap stage-unknownQualidade da evidência: complete · Variantes de ambiente: 1 · Primeiro registro: 2026-09-16 · Visto por último: 2026-09-16Candidato a reverificação diagnóstica
-
observado UNKNOWN exit 1 ERR_ASSERTION Lacuna de evidência ×1 22.20.3 executionContext=node · moduleSystem=cjs · os=linux · runtime=node@22.23 sha256:b12460008ca6…Test failed: AssertionError [ERR_ASSERTION]: Expected values to be strictly equal: · true !== false · at runTests (<url>) · at <url>node · unclassified-diagnostic · outer node · gap stage-unknownQualidade da evidência: complete · Variantes de ambiente: 1 · Primeiro registro: 2026-09-16 · Visto por último: 2026-09-16Candidato a reverificação diagnóstica
-
observado UNKNOWN exit 1 Lacuna de evidência ×1 22.20.3 executionContext=node · moduleSystem=cjs · os=linux · runtime=node@22.23 sha256:c0573fd829b8…<url> · import confirm, { promptConfirm } from <str>; · ^^^^^^^ · SyntaxError: The requested module <str> does not provide an export named <str>node · unclassified-diagnostic · outer node · gap stage-unknownQualidade da evidência: complete · Variantes de ambiente: 1 · Primeiro registro: 2026-09-16 · Visto por último: 2026-09-16Candidato a reverificação diagnóstica
-
observado UNKNOWN exit 1 ERR_ASSERTION Lacuna de evidência ×1 22.20.3 executionContext=node · moduleSystem=cjs · os=linux · runtime=node@22.23 sha256:deb29d18a641…Test failed: AssertionError [ERR_ASSERTION]: Expected values to be strictly equal: · + actual - expected · + <str> · - <str>node · unclassified-diagnostic · outer node · gap stage-unknownQualidade da evidência: complete · Variantes de ambiente: 1 · Primeiro registro: 2026-09-16 · Visto por último: 2026-09-16Candidato a reverificação diagnóstica
-
observado UNKNOWN exit 1 ERR_ASSERTION Lacuna de evidência ×1 22.20.3 executionContext=node · moduleSystem=esm · os=linux · runtime=node@22.23 sha256:eff444dbb236…Contract test failure: AssertionError [ERR_ASSERTION]: Plain object should not be identified as Separator · true !== false · at testSeparator (<url>) …node · unclassified-diagnostic · outer node · gap stage-unknownQualidade da evidência: complete · Variantes de ambiente: 1 · Primeiro registro: 2026-09-16 · Visto por último: 2026-09-16Candidato a reverificação diagnóstica
Símbolos
Ainda não há símbolos com evidências.