Relevésgolanggithub.com/prometheus/commonv0.71.0github.com/prometheus/common/expfmt.NewFormat
Changer les conditions
Conditions actuelles
github.com/prometheus/common/expfmt.NewFormat @v0.71.0ubuntu glibc · x64 · node 22 · npm 10 · node
0 sur 7 ont réussi
Vérifié — ce réseau a exécuté un contrat à cette coordonnée.
il y a un échantillon ici et notre exécution à cette coordonnée a échoué
- Observations de projets
- 21 / 21
- Vérifications de contrat
- 0 / 7
- Pairs rapporteurs indépendants
- 2
- Dernier enregistrement
- 2026-09-05
Santé des dépendances
Combinaisons observées et preuves d'échec pour cette version
Premier échec observé
v0.71.0
linux · node@22.23 · executionContext=node · moduleSystem=cjs
5 FAIL
· stage: UNKNOWN
· fingerprint: sha256:88af852f99a8104e4bc3c23eea27ebf2990625ccabf45313970f5fd7fe56c4e2
| Bibliothèque | Version | Santé | Mesuré là-bas | Projets |
|---|---|---|---|---|
| github.com/golang-jwt/jwt/v5 | v5.3.1 | CANDIDATE Changement corrélé; combinaison non prouvée | contrat réussi | 3 jours-projet |
| github.com/google/go-cmp | v0.7.0 | CANDIDATE Changement corrélé; combinaison non prouvée | contrat réussi | 3 jours-projet |
| github.com/prometheus/client_model | v0.6.2 | CANDIDATE Changement corrélé; combinaison non prouvée | contrat réussi | 3 jours-projet |
| github.com/stretchr/testify | v1.12.1 | CANDIDATE Changement corrélé; combinaison non prouvée | builds observés | 3 jours-projet |
| golang.org/x/net | v0.58.0 | CANDIDATE Changement corrélé; combinaison non prouvée | contrat réussi | 3 jours-projet |
| golang.org/x/oauth2 | v0.36.0 | CANDIDATE Changement corrélé; combinaison non prouvée | contrat réussi | 3 jours-projet |
| google.golang.org/protobuf | v1.36.12 | CANDIDATE Changement corrélé; combinaison non prouvée | contrat réussi | 3 jours-projet |
| github.com/alecthomas/kingpin/v2 | v2.4.0 | UNKNOWN Aucun résultat mesuré lié | rien de mesuré | 3 jours-projet |
| github.com/google/uuid | v1.6.0 | PASS Toutes les observations ont réussi | contrat réussi | 3 jours-projet |
| github.com/julienschmidt/httprouter | v1.3.0 | PASS Toutes les observations ont réussi | contrat réussi | 3 jours-projet |
| github.com/munnerz/goautoneg | v0.0.0-20191010083416-a7dc8b61c822 | PASS Toutes les observations ont réussi | contrat réussi | 3 jours-projet |
| github.com/mwitkow/go-conntrack | v0.0.0-20190716064945-2f068394615f | PASS Toutes les observations ont réussi | contrat réussi | 3 jours-projet |
| go.yaml.in/yaml/v2 | v2.4.4 | PASS Toutes les observations ont réussi | contrat réussi | 3 jours-projet |
La colonne de mesure porte sur la version de chaque dépendance elle-même, pas sur la paire. Qu'un résolveur ait placé deux versions côte à côte ne prouve pas qu'elles fonctionnent ensemble.
Versions des dépendances au fil des versions
Ce vers quoi chaque version de ce paquet a résolu ses enfants. L'enfant dont la version a bougé vient en premier : c'est là qu'une mise à jour a changé quelque chose sous vos pieds.
Ont bougé : 10 · identiques à chaque version : 12
Une arête indique qu'un résolveur a placé une version à côté d'une autre sur une machine réelle. Ce n'est pas une affirmation qu'elles fonctionnent ensemble ; à cette question répondent les échantillons et les contrats, pas la présence d'une ligne.
Clusters d'échecs récents
-
observé UNKNOWN exit 1 ERR_MODULE_NOT_FOUND Lacune de preuve ×5 v0.33.0 → v0.71.0 executionContext=node · moduleSystem=cjs · os=linux · runtime=node@22.23 github.com/prometheus/common/expfmt.NewFormat sha256:88af852f99a8…node:internal/modules/package_json_reader:<n> · throw new ERR_MODULE_NOT_FOUND(packageName, fileURLToPath(base), null); · ^ …node · unclassified-diagnostic · outer node · gap stage-unknownQualité de preuve: complete · Variantes d’environnement: 1 · Premier relevé: 2026-08-29 · Dernière observation: 2026-09-05Candidat à une revérification diagnostique
-
observé UNKNOWN exit 1 Lacune de preuve ×1 v0.71.0 executionContext=node · moduleSystem=cjs · os=linux · runtime=node@22.23 github.com/prometheus/common/expfmt.NewFormat sha256:69ab38336834…assertion 1 failed: expected text/plain; version=0.0.4; charset=utf-8, got text/plain; version=0.0.4; charset=utf-8; escaping=underscores · exit status 1go · unclassified-diagnostic · outer go run · gap stage-unknownQualité de preuve: complete · Variantes d’environnement: 1 · Premier relevé: 2026-09-05 · Dernière observation: 2026-09-05Candidat à une revérification diagnostique
-
observé UNKNOWN exit 1 ERR_ASSERTION Lacune de preuve ×1 v0.71.0 executionContext=node · moduleSystem=cjs · os=linux · runtime=node@22.23 github.com/prometheus/common/expfmt.NewFormat sha256:761ce8fa9777…node:assert:<n> · throw new AssertionError(obj); · ^ · AssertionError [ERR_ASSERTION]: Should yield 4 tokens for const answer = 42;node · unclassified-diagnostic · outer node · gap stage-unknownQualité de preuve: complete · Variantes d’environnement: 1 · Premier relevé: 2026-09-05 · Dernière observation: 2026-09-05Candidat à une revérification diagnostique
-
observé UNKNOWN exit 1 Lacune de preuve ×1 v0.71.0 executionContext=node · moduleSystem=cjs · os=linux · runtime=node@22.23 github.com/prometheus/common/expfmt.NewFormat sha256:3b3190f2cd44…doc: cannot find package <str> in any of: · ($GOROOT not set) · <path> (from $GOPATH)go · unclassified-diagnostic · outer go · gap stage-unknownQualité de preuve: complete · Variantes d’environnement: 1 · Premier relevé: 2026-09-05 · Dernière observation: 2026-09-05Candidat à une revérification diagnostique
-
observé UNKNOWN exit 1 ERR_ASSERTION Lacune de preuve ×1 v0.71.0 executionContext=node · moduleSystem=cjs · os=linux · runtime=node@22.23 github.com/prometheus/common/expfmt.NewFormat sha256:986d98189e70…node:internal/modules/run_main:<n> · triggerUncaughtException( · ^ · AssertionError [ERR_ASSERTION]: Expected values to be strictly equal:node · unclassified-diagnostic · outer node · gap stage-unknownQualité de preuve: complete · Variantes d’environnement: 1 · Premier relevé: 2026-09-05 · Dernière observation: 2026-09-05Candidat à une revérification diagnostique
-
observé UNKNOWN exit 1 ERR_ASSERTION Lacune de preuve ×1 v0.71.0 executionContext=node · moduleSystem=cjs · os=linux · runtime=node@22.23 github.com/prometheus/common/expfmt.NewFormat sha256:b820b4edc1a5…node:internal/modules/run_main:<n> · triggerUncaughtException( · ^ · AssertionError [ERR_ASSERTION]: should produce 4 tokens before eof for <str>node · unclassified-diagnostic · outer node · gap stage-unknownQualité de preuve: complete · Variantes d’environnement: 1 · Premier relevé: 2026-09-05 · Dernière observation: 2026-09-05Candidat à une revérification diagnostique
-
observé UNKNOWN exit 1 ERR_ASSERTION Lacune de preuve ×1 v0.71.0 executionContext=node · moduleSystem=cjs · os=linux · runtime=node@22.23 github.com/prometheus/common/expfmt.NewFormat sha256:d5180246550d…node:internal/modules/run_main:<n> · triggerUncaughtException( · ^ · AssertionError [ERR_ASSERTION]: Expected <str> to be reference-equal to <str>:node · unclassified-diagnostic · outer node · gap stage-unknownQualité de preuve: complete · Variantes d’environnement: 1 · Premier relevé: 2026-09-05 · Dernière observation: 2026-09-05Candidat à une revérification diagnostique