Registrosgolanggithub.com/prometheus/commonv0.71.0github.com/prometheus/common/expfmt.FmtText
Mudar as condições
Condições atuais
github.com/prometheus/common/expfmt.FmtText @v0.71.0ubuntu glibc · x64 · node 22 · npm 10 · node
0 de 7 passaram
Verificado — esta rede executou um contrato nesta coordenada.
há uma amostra aqui e nossa execução nesta coordenada falhou
- Observações de projetos
- 21 / 21
- Verificações de contrato
- 0 / 7
- Peers independentes que reportaram
- 2
- Último registro
- 2026-09-05
Saúde das dependências
Combinações observadas e evidências de falha para esta versão
Primeira quebra observada
v0.71.0
linux · node@22.23 · moduleSystem=cjs · executionContext=node
5 FAIL
· stage: UNKNOWN
· fingerprint: sha256:88af852f99a8104e4bc3c23eea27ebf2990625ccabf45313970f5fd7fe56c4e2
| Biblioteca | Versão | Saúde | Medido ali | Projetos |
|---|---|---|---|---|
| github.com/golang-jwt/jwt/v5 | v5.3.1 | CANDIDATE Mudança correlacionada; combinação não comprovada | contrato aprovado | 3 dias-projeto |
| github.com/google/go-cmp | v0.7.0 | CANDIDATE Mudança correlacionada; combinação não comprovada | contrato aprovado | 3 dias-projeto |
| github.com/prometheus/client_model | v0.6.2 | CANDIDATE Mudança correlacionada; combinação não comprovada | contrato aprovado | 3 dias-projeto |
| github.com/stretchr/testify | v1.12.1 | CANDIDATE Mudança correlacionada; combinação não comprovada | builds observados | 3 dias-projeto |
| golang.org/x/net | v0.58.0 | CANDIDATE Mudança correlacionada; combinação não comprovada | contrato aprovado | 3 dias-projeto |
| golang.org/x/oauth2 | v0.36.0 | CANDIDATE Mudança correlacionada; combinação não comprovada | contrato aprovado | 3 dias-projeto |
| google.golang.org/protobuf | v1.36.12 | CANDIDATE Mudança correlacionada; combinação não comprovada | contrato aprovado | 3 dias-projeto |
| github.com/alecthomas/kingpin/v2 | v2.4.0 | UNKNOWN Sem resultado medido vinculado | nada medido | 3 dias-projeto |
| github.com/google/uuid | v1.6.0 | PASS Todas as observações passaram | contrato aprovado | 3 dias-projeto |
| github.com/julienschmidt/httprouter | v1.3.0 | PASS Todas as observações passaram | contrato aprovado | 3 dias-projeto |
| github.com/munnerz/goautoneg | v0.0.0-20191010083416-a7dc8b61c822 | PASS Todas as observações passaram | contrato aprovado | 3 dias-projeto |
| github.com/mwitkow/go-conntrack | v0.0.0-20190716064945-2f068394615f | PASS Todas as observações passaram | contrato aprovado | 3 dias-projeto |
| go.yaml.in/yaml/v2 | v2.4.4 | PASS Todas as observações passaram | contrato aprovado | 3 dias-projeto |
A coluna de medição é sobre a versão de cada dependência em si, não sobre o par. Um resolvedor ter colocado duas versões lado a lado não é prova de que funcionam juntas.
Versões de dependências por versão
Para que cada versão deste pacote resolveu seus filhos. O filho cuja versão se moveu vem primeiro: foi ali que uma atualização mudou algo sob os seus pés.
Moveram-se: 10 · iguais em todas as versões: 12
Uma aresta registra que um resolvedor colocou uma versão ao lado de outra em uma máquina real. Não é uma afirmação de que as duas funcionam juntas; essa pergunta é respondida por amostras e contratos, não pela presença de uma linha.
Clusters de falha recentes
-
observado UNKNOWN exit 1 ERR_MODULE_NOT_FOUND Lacuna de evidência ×5 v0.33.0 → v0.71.0 executionContext=node · moduleSystem=cjs · os=linux · runtime=node@22.23 github.com/prometheus/common/expfmt.FmtText sha256:88af852f99a8…node:internal/modules/package_json_reader:<n> · throw new ERR_MODULE_NOT_FOUND(packageName, fileURLToPath(base), null); · ^ …node · unclassified-diagnostic · outer node · gap stage-unknownQualidade da evidência: complete · Variantes de ambiente: 1 · Primeiro registro: 2026-08-29 · Visto por último: 2026-09-05Candidato a reverificação diagnóstica
-
observado UNKNOWN exit 1 Lacuna de evidência ×1 v0.71.0 executionContext=node · moduleSystem=cjs · os=linux · runtime=node@22.23 github.com/prometheus/common/expfmt.FmtText sha256:69ab38336834…assertion 1 failed: expected text/plain; version=0.0.4; charset=utf-8, got text/plain; version=0.0.4; charset=utf-8; escaping=underscores · exit status 1go · unclassified-diagnostic · outer go run · gap stage-unknownQualidade da evidência: complete · Variantes de ambiente: 1 · Primeiro registro: 2026-09-05 · Visto por último: 2026-09-05Candidato a reverificação diagnóstica
-
observado UNKNOWN exit 1 ERR_ASSERTION Lacuna de evidência ×1 v0.71.0 executionContext=node · moduleSystem=cjs · os=linux · runtime=node@22.23 github.com/prometheus/common/expfmt.FmtText sha256:761ce8fa9777…node:assert:<n> · throw new AssertionError(obj); · ^ · AssertionError [ERR_ASSERTION]: Should yield 4 tokens for const answer = 42;node · unclassified-diagnostic · outer node · gap stage-unknownQualidade da evidência: complete · Variantes de ambiente: 1 · Primeiro registro: 2026-09-05 · Visto por último: 2026-09-05Candidato a reverificação diagnóstica
-
observado UNKNOWN exit 1 Lacuna de evidência ×1 v0.71.0 executionContext=node · moduleSystem=cjs · os=linux · runtime=node@22.23 github.com/prometheus/common/expfmt.FmtText sha256:3b3190f2cd44…doc: cannot find package <str> in any of: · ($GOROOT not set) · <path> (from $GOPATH)go · unclassified-diagnostic · outer go · gap stage-unknownQualidade da evidência: complete · Variantes de ambiente: 1 · Primeiro registro: 2026-09-05 · Visto por último: 2026-09-05Candidato a reverificação diagnóstica
-
observado UNKNOWN exit 1 ERR_ASSERTION Lacuna de evidência ×1 v0.71.0 executionContext=node · moduleSystem=cjs · os=linux · runtime=node@22.23 github.com/prometheus/common/expfmt.FmtText sha256:986d98189e70…node:internal/modules/run_main:<n> · triggerUncaughtException( · ^ · AssertionError [ERR_ASSERTION]: Expected values to be strictly equal:node · unclassified-diagnostic · outer node · gap stage-unknownQualidade da evidência: complete · Variantes de ambiente: 1 · Primeiro registro: 2026-09-05 · Visto por último: 2026-09-05Candidato a reverificação diagnóstica
-
observado UNKNOWN exit 1 ERR_ASSERTION Lacuna de evidência ×1 v0.71.0 executionContext=node · moduleSystem=cjs · os=linux · runtime=node@22.23 github.com/prometheus/common/expfmt.FmtText sha256:b820b4edc1a5…node:internal/modules/run_main:<n> · triggerUncaughtException( · ^ · AssertionError [ERR_ASSERTION]: should produce 4 tokens before eof for <str>node · unclassified-diagnostic · outer node · gap stage-unknownQualidade da evidência: complete · Variantes de ambiente: 1 · Primeiro registro: 2026-09-05 · Visto por último: 2026-09-05Candidato a reverificação diagnóstica
-
observado UNKNOWN exit 1 ERR_ASSERTION Lacuna de evidência ×1 v0.71.0 executionContext=node · moduleSystem=cjs · os=linux · runtime=node@22.23 github.com/prometheus/common/expfmt.FmtText sha256:d5180246550d…node:internal/modules/run_main:<n> · triggerUncaughtException( · ^ · AssertionError [ERR_ASSERTION]: Expected <str> to be reference-equal to <str>:node · unclassified-diagnostic · outer node · gap stage-unknownQualidade da evidência: complete · Variantes de ambiente: 1 · Primeiro registro: 2026-09-05 · Visto por último: 2026-09-05Candidato a reverificação diagnóstica