記録golanggithub.com/prometheus/commonv0.71.0github.com/prometheus/common/expfmt.FmtOpenMetrics_1_0_0
条件を変更
現在の条件
github.com/prometheus/common/expfmt.FmtOpenMetrics_1_0_0 @v0.71.0ubuntu glibc · x64 · node 22 · npm 10 · node
7 回中 0 回が成功
検証 — このネットワークがこの座標でコントラクトを実行しました。
サンプルあり — この座標で実行し、失敗した
- プロジェクト観測
- 21 / 21
- コントラクト検証
- 0 / 7
- 独立した報告ピア
- 2
- 最終記録
- 2026-09-05
開ける証拠
依存関係のヘルス
このリリースの依存関係の組み合わせと失敗観測
観測された問題 1件 ·
変更 7件 ·
未確認 1件 ·
正常 5件
| ライブラリ | バージョン | ヘルス | その座標で測定されたこと | プロジェクト |
|---|---|---|---|---|
| github.com/golang-jwt/jwt/v5 | v5.3.1 | CANDIDATE 相関変更; 組み合わせ未証明 | コントラクト合格 | プロジェクト日 3 件 |
| github.com/google/go-cmp | v0.7.0 | CANDIDATE 相関変更; 組み合わせ未証明 | コントラクト合格 | プロジェクト日 3 件 |
| github.com/prometheus/client_model | v0.6.2 | CANDIDATE 相関変更; 組み合わせ未証明 | コントラクト合格 | プロジェクト日 3 件 |
| github.com/stretchr/testify | v1.12.1 | CANDIDATE 相関変更; 組み合わせ未証明 | ビルド観測済み | プロジェクト日 3 件 |
| golang.org/x/net | v0.58.0 | CANDIDATE 相関変更; 組み合わせ未証明 | コントラクト合格 | プロジェクト日 3 件 |
| golang.org/x/oauth2 | v0.36.0 | CANDIDATE 相関変更; 組み合わせ未証明 | コントラクト合格 | プロジェクト日 3 件 |
| google.golang.org/protobuf | v1.36.12 | CANDIDATE 相関変更; 組み合わせ未証明 | コントラクト合格 | プロジェクト日 3 件 |
| github.com/alecthomas/kingpin/v2 | v2.4.0 | UNKNOWN 紐づく測定結果なし | 測定なし | プロジェクト日 3 件 |
| github.com/google/uuid | v1.6.0 | PASS すべての観測で成功 | コントラクト合格 | プロジェクト日 3 件 |
| github.com/julienschmidt/httprouter | v1.3.0 | PASS すべての観測で成功 | コントラクト合格 | プロジェクト日 3 件 |
| github.com/munnerz/goautoneg | v0.0.0-20191010083416-a7dc8b61c822 | PASS すべての観測で成功 | コントラクト合格 | プロジェクト日 3 件 |
| github.com/mwitkow/go-conntrack | v0.0.0-20190716064945-2f068394615f | PASS すべての観測で成功 | コントラクト合格 | プロジェクト日 3 件 |
| go.yaml.in/yaml/v2 | v2.4.4 | PASS すべての観測で成功 | コントラクト合格 | プロジェクト日 3 件 |
測定列は各依存関係自身のリリースに関するもので、2つのリリースの組み合わせに関するものではありません。リゾルバが2つを並べたという事実は、両者が協調して動く証拠ではありません。
リリースごとの依存バージョン
このパッケージの各リリースが子をどのバージョンに解決したかです。バージョンが動いた子が先に並びます — アップグレードが足元で何かを変えた地点です。
変動: 10 · 全リリースで同一: 12
エッジは、実機でリゾルバがあるリリースを別のリリースの隣に置いたという記録です。両者が一緒に動くという主張ではありません。その問いに答えるのは、ここに行があることではなくサンプルと契約です。
最近の失敗クラスター
-
観測済み UNKNOWN exit 1 ERR_MODULE_NOT_FOUND 証拠の欠落 ×5 v0.33.0 → v0.71.0 executionContext=node · moduleSystem=cjs · os=linux · runtime=node@22.23 github.com/prometheus/common/expfmt.FmtOpenMetrics_1_0_0 sha256:88af852f99a8…node:internal/modules/package_json_reader:<n> · throw new ERR_MODULE_NOT_FOUND(packageName, fileURLToPath(base), null); · ^ …node · unclassified-diagnostic · outer node · gap stage-unknown証拠品質: complete · 環境バリアント: 1 · 初回記録: 2026-08-29 · 最終観測: 2026-09-05診断再検証候補
-
観測済み UNKNOWN exit 1 証拠の欠落 ×1 v0.71.0 executionContext=node · moduleSystem=cjs · os=linux · runtime=node@22.23 github.com/prometheus/common/expfmt.FmtOpenMetrics_1_0_0 sha256:69ab38336834…assertion 1 failed: expected text/plain; version=0.0.4; charset=utf-8, got text/plain; version=0.0.4; charset=utf-8; escaping=underscores · exit status 1go · unclassified-diagnostic · outer go run · gap stage-unknown証拠品質: complete · 環境バリアント: 1 · 初回記録: 2026-09-05 · 最終観測: 2026-09-05診断再検証候補
-
観測済み UNKNOWN exit 1 ERR_ASSERTION 証拠の欠落 ×1 v0.71.0 executionContext=node · moduleSystem=cjs · os=linux · runtime=node@22.23 github.com/prometheus/common/expfmt.FmtOpenMetrics_1_0_0 sha256:761ce8fa9777…node:assert:<n> · throw new AssertionError(obj); · ^ · AssertionError [ERR_ASSERTION]: Should yield 4 tokens for const answer = 42;node · unclassified-diagnostic · outer node · gap stage-unknown証拠品質: complete · 環境バリアント: 1 · 初回記録: 2026-09-05 · 最終観測: 2026-09-05診断再検証候補
-
観測済み UNKNOWN exit 1 証拠の欠落 ×1 v0.71.0 executionContext=node · moduleSystem=cjs · os=linux · runtime=node@22.23 github.com/prometheus/common/expfmt.FmtOpenMetrics_1_0_0 sha256:3b3190f2cd44…doc: cannot find package <str> in any of: · ($GOROOT not set) · <path> (from $GOPATH)go · unclassified-diagnostic · outer go · gap stage-unknown証拠品質: complete · 環境バリアント: 1 · 初回記録: 2026-09-05 · 最終観測: 2026-09-05診断再検証候補
-
観測済み UNKNOWN exit 1 ERR_ASSERTION 証拠の欠落 ×1 v0.71.0 executionContext=node · moduleSystem=cjs · os=linux · runtime=node@22.23 github.com/prometheus/common/expfmt.FmtOpenMetrics_1_0_0 sha256:986d98189e70…node:internal/modules/run_main:<n> · triggerUncaughtException( · ^ · AssertionError [ERR_ASSERTION]: Expected values to be strictly equal:node · unclassified-diagnostic · outer node · gap stage-unknown証拠品質: complete · 環境バリアント: 1 · 初回記録: 2026-09-05 · 最終観測: 2026-09-05診断再検証候補
-
観測済み UNKNOWN exit 1 ERR_ASSERTION 証拠の欠落 ×1 v0.71.0 executionContext=node · moduleSystem=cjs · os=linux · runtime=node@22.23 github.com/prometheus/common/expfmt.FmtOpenMetrics_1_0_0 sha256:b820b4edc1a5…node:internal/modules/run_main:<n> · triggerUncaughtException( · ^ · AssertionError [ERR_ASSERTION]: should produce 4 tokens before eof for <str>node · unclassified-diagnostic · outer node · gap stage-unknown証拠品質: complete · 環境バリアント: 1 · 初回記録: 2026-09-05 · 最終観測: 2026-09-05診断再検証候補
-
観測済み UNKNOWN exit 1 ERR_ASSERTION 証拠の欠落 ×1 v0.71.0 executionContext=node · moduleSystem=cjs · os=linux · runtime=node@22.23 github.com/prometheus/common/expfmt.FmtOpenMetrics_1_0_0 sha256:d5180246550d…node:internal/modules/run_main:<n> · triggerUncaughtException( · ^ · AssertionError [ERR_ASSERTION]: Expected <str> to be reference-equal to <str>:node · unclassified-diagnostic · outer node · gap stage-unknown証拠品質: complete · 環境バリアント: 1 · 初回記録: 2026-09-05 · 最終観測: 2026-09-05診断再検証候補