Relevésgolanggithub.com/prometheus/commonv0.71.0github.com/prometheus/common/version.GoOS
Matrice de compatibilité
Les observations au niveau projet et les vérifications de symbole/contrat sont comptées séparément et jamais additionnées.
Ces chiffres ne distinguent pas la façon dont le symbole a été appelé : surcharges, formes d'arguments et options sont regroupées. Ce que fait une forme d'appel précise est prouvé par le contrat d'un échantillon, pas par ces nombres.
| Environnement | Confiance | Observations | Vérifié | Taux de réussite | Pairs | Dernière observation |
|---|---|---|---|---|---|---|
| go 1.26 · Go · go · linux glibc
Observations: PROJECT_PROCESS 1✓
|
LOW | 1 | 0 | 100 % | 1 | 2026-09-05 |
snapshot · 2026-09-15
Clusters d'échecs
-
observé UNKNOWN exit 1 ERR_MODULE_NOT_FOUND Lacune de preuve ×5 v0.33.0 → v0.71.0 executionContext=node · moduleSystem=cjs · os=linux · runtime=node@22.23 sha256:88af852f99a8…node:internal/modules/package_json_reader:<n> · throw new ERR_MODULE_NOT_FOUND(packageName, fileURLToPath(base), null); · ^ …node · unclassified-diagnostic · outer node · gap stage-unknownQualité de preuve: complete · Variantes d’environnement: 1 · Premier relevé: 2026-08-29 · Dernière observation: 2026-09-05Candidat à une revérification diagnostique
-
observé PROJECT_TEST exit 1 ×1 v0.71.0 os=linux · runtime=go@1.26 sha256:b6b777e6b2eb…--- FAIL: TestPromslogLevels (0.00s) · === RUN TestPromslogFormats · contract_test.go:<n>: expected default format <str>, got <str> …go/test · test-runner-diagnostic · outer go testQualité de preuve: complete · Variantes d’environnement: 1 · Premier relevé: 2026-09-05 · Dernière observation: 2026-09-05
-
observé UNKNOWN exit 1 Lacune de preuve ×1 v0.71.0 os=linux · runtime=go@1.26 sha256:042f6e977a16…go: updates to go.mod needed; to update it: · go mod tidygo · unclassified-diagnostic · outer go run · gap stage-unknownQualité de preuve: complete · Variantes d’environnement: 1 · Premier relevé: 2026-09-05 · Dernière observation: 2026-09-05Candidat à une revérification diagnostique
-
observé UNKNOWN exit 1 Lacune de preuve ×1 v0.71.0 executionContext=node · moduleSystem=cjs · os=linux · runtime=node@22.23 sha256:69ab38336834…assertion 1 failed: expected text/plain; version=0.0.4; charset=utf-8, got text/plain; version=0.0.4; charset=utf-8; escaping=underscores · exit status 1go · unclassified-diagnostic · outer go run · gap stage-unknownQualité de preuve: complete · Variantes d’environnement: 1 · Premier relevé: 2026-09-05 · Dernière observation: 2026-09-05Candidat à une revérification diagnostique
-
observé UNKNOWN exit 1 Lacune de preuve ×1 v0.71.0 os=linux · runtime=go@1.26 sha256:ccff0aa5ca9d…expected default format logfmt, got · exit status 1go · unclassified-diagnostic · outer go run · gap stage-unknownQualité de preuve: complete · Variantes d’environnement: 1 · Premier relevé: 2026-09-05 · Dernière observation: 2026-09-05Candidat à une revérification diagnostique
-
observé UNKNOWN exit 1 ERR_ASSERTION Lacune de preuve ×1 v0.71.0 executionContext=node · moduleSystem=cjs · os=linux · runtime=node@22.23 sha256:761ce8fa9777…node:assert:<n> · throw new AssertionError(obj); · ^ · AssertionError [ERR_ASSERTION]: Should yield 4 tokens for const answer = 42;node · unclassified-diagnostic · outer node · gap stage-unknownQualité de preuve: complete · Variantes d’environnement: 1 · Premier relevé: 2026-09-05 · Dernière observation: 2026-09-05Candidat à une revérification diagnostique
-
observé UNKNOWN exit 1 Lacune de preuve ×1 v0.71.0 executionContext=node · moduleSystem=cjs · os=linux · runtime=node@22.23 sha256:3b3190f2cd44…doc: cannot find package <str> in any of: · ($GOROOT not set) · <path> (from $GOPATH)go · unclassified-diagnostic · outer go · gap stage-unknownQualité de preuve: complete · Variantes d’environnement: 1 · Premier relevé: 2026-09-05 · Dernière observation: 2026-09-05Candidat à une revérification diagnostique
-
observé UNKNOWN exit 1 ERR_ASSERTION Lacune de preuve ×1 v0.71.0 executionContext=node · moduleSystem=cjs · os=linux · runtime=node@22.23 sha256:986d98189e70…node:internal/modules/run_main:<n> · triggerUncaughtException( · ^ · AssertionError [ERR_ASSERTION]: Expected values to be strictly equal:node · unclassified-diagnostic · outer node · gap stage-unknownQualité de preuve: complete · Variantes d’environnement: 1 · Premier relevé: 2026-09-05 · Dernière observation: 2026-09-05Candidat à une revérification diagnostique
-
observé UNKNOWN exit 1 ERR_ASSERTION Lacune de preuve ×1 v0.71.0 executionContext=node · moduleSystem=cjs · os=linux · runtime=node@22.23 sha256:b820b4edc1a5…node:internal/modules/run_main:<n> · triggerUncaughtException( · ^ · AssertionError [ERR_ASSERTION]: should produce 4 tokens before eof for <str>node · unclassified-diagnostic · outer node · gap stage-unknownQualité de preuve: complete · Variantes d’environnement: 1 · Premier relevé: 2026-09-05 · Dernière observation: 2026-09-05Candidat à une revérification diagnostique
-
observé UNKNOWN exit 1 ERR_ASSERTION Lacune de preuve ×1 v0.71.0 executionContext=node · moduleSystem=cjs · os=linux · runtime=node@22.23 sha256:d5180246550d…node:internal/modules/run_main:<n> · triggerUncaughtException( · ^ · AssertionError [ERR_ASSERTION]: Expected <str> to be reference-equal to <str>:node · unclassified-diagnostic · outer node · gap stage-unknownQualité de preuve: complete · Variantes d’environnement: 1 · Premier relevé: 2026-09-05 · Dernière observation: 2026-09-05Candidat à une revérification diagnostique