记录cargozerofrom-derive0.1.8
环境详情
项目级观测与符号/契约验证分别统计,绝不合并。
这些计数不区分符号的调用方式:重载、参数形态和选项被合并统计。某一具体调用方式的行为由样本的契约证明,而不是由这些数字证明。
| 环境 | 置信度 | 观测 | 验证 | 通过率 | 节点 | 最近观测 |
|---|---|---|---|---|---|---|
| unknown · Rust · cargo · linux glibc
观测: PROJECT_COMPILE 8✓ 30✕ · PROJECT_PROCESS 75✓ · PROJECT_TEST 1✓ — 使用: USED 5✓ — 验证: UNKNOWN 0✓ 1✕
|
ELEVATED FAILURE | 114 +5 | 1 | 73% | 1 | 2026-10-19 |
| rust 1 · Rust · cargo · linux musl · docker
使用: USED 5✓
|
LOW | 0 +5 | 0 | — | 1 | 2026-10-19 |
近期失败聚类
-
已观测 PROJECT_COMPILE exit 101 ×5 0.1.8 os=linux sha256:113664d7d918…error: could not compile `probe_icu` (bin <str>) due to 1 previous errorrust/rustc · compiler-diagnostic · outer cargo run证据质量: complete · 环境变体: 1 · 首次记录: 2026-09-20 · 最近观测: 2026-09-20
-
已观测 PROJECT_COMPILE exit 101 E0599 ×2 0.1.8 os=linux sha256:2b5f9f03ee2f…error[E0599]: no method named `get_set_for_value` found for struct `CodePointMapDataBorrowed<'a, T>` in the current scoperust/rustc · compiler-diagnostic · outer cargo run证据质量: complete · 环境变体: 1 · 首次记录: 2026-09-19 · 最近观测: 2026-09-20
-
已观测 PROJECT_COMPILE exit 101 ×2 0.1.8 os=linux sha256:402a59d53b18…error: could not compile `test-cargo` (bin <str>) due to 1 previous errorrust/rustc · compiler-diagnostic · outer cargo run证据质量: complete · 环境变体: 1 · 首次记录: 2026-09-20 · 最近观测: 2026-09-20
-
已观测 PROJECT_COMPILE exit 101 E0277 ×1 0.1.8 os=linux sha256:0f120d64ab10…error[E0277]: the trait bound `u8: From<GeneralCategory>` is not satisfiedrust/rustc · compiler-diagnostic · outer cargo run证据质量: complete · 环境变体: 1 · 首次记录: 2026-09-20 · 最近观测: 2026-09-20
-
已观测 PROJECT_COMPILE exit 101 E0599 ×1 0.1.8 os=linux sha256:0fbd73add053…error[E0599]: no method named `is_empty` found for struct `Char16Trie<'data>` in the current scoperust/rustc · compiler-diagnostic · outer cargo run证据质量: complete · 环境变体: 1 · 首次记录: 2026-09-20 · 最近观测: 2026-09-20
-
已观测 PROJECT_COMPILE exit 101 E0599 ×1 0.1.8 os=linux sha256:16d23d1801b1…error[E0599]: no method named `normalize` found for struct `ComposingNormalizer` in the current scoperust/rustc · compiler-diagnostic · outer cargo run证据质量: complete · 环境变体: 1 · 首次记录: 2026-09-20 · 最近观测: 2026-09-20
-
已观测 PROJECT_COMPILE exit 101 ×1 0.1.8 os=linux sha256:233e69cc0ea0…error: could not compile `test-prop` (bin <str>) due to 2 previous errorsrust/rustc · compiler-diagnostic · outer cargo run证据质量: complete · 环境变体: 1 · 首次记录: 2026-09-20 · 最近观测: 2026-09-20
-
已观测 PROJECT_COMPILE exit 101 E0599 ×1 0.1.8 os=linux sha256:267702ebcc26…error[E0599]: no associated function or constant named `new_nfc_unstable` found for struct `ComposingNormalizer` in the current scoperust/rustc · compiler-diagnostic · outer cargo run证据质量: complete · 环境变体: 1 · 首次记录: 2026-09-20 · 最近观测: 2026-09-20
-
已观测 PROJECT_COMPILE exit 101 E0609 ×1 0.1.8 os=linux sha256:463107715912…error[E0609]: no field `SINGLETON_NORMALIZER_NFC_V1` on type `MyProvider`rust/rustc · compiler-diagnostic · outer cargo run证据质量: complete · 环境变体: 1 · 首次记录: 2026-09-20 · 最近观测: 2026-09-20
-
已观测 PROJECT_COMPILE exit 101 ×1 0.1.8 os=linux sha256:5ee7225f0fbd…error: could not compile `sample-icu-properties` (bin <str>) due to 1 previous errorrust/rustc · compiler-diagnostic · outer cargo run证据质量: complete · 环境变体: 1 · 首次记录: 2026-09-20 · 最近观测: 2026-09-20
-
已观测 PROJECT_COMPILE exit 101 E0597 ×1 0.1.8 os=linux sha256:61047e2c2906…error[E0597]: `gc_owned` does not live long enoughrust/rustc · compiler-diagnostic · outer cargo run证据质量: complete · 环境变体: 1 · 首次记录: 2026-09-20 · 最近观测: 2026-09-20
-
已观测 PROJECT_COMPILE exit 101 E0599 ×1 0.1.8 os=linux sha256:780bb54cf72f…error[E0599]: no method named `as_borrowed` found for struct `CodePointSetDataBorrowed<'a>` in the current scoperust/rustc · compiler-diagnostic · outer cargo run证据质量: complete · 环境变体: 1 · 首次记录: 2026-09-20 · 最近观测: 2026-09-20
显示报告最多的 12 个。此坐标记录的失败聚类共 25 个。其余为单次报告。
符号
暂无带证据的符号。