記録cargoyoke-derive0.8.3
環境の詳細
プロジェクトレベルの観測とシンボル/コントラクト検証は別々に集計し、決して合算しません。
これらの数値は、シンボルがどう呼び出されたかを区別しません。オーバーロード、引数の形、オプションはまとめて集計されます。特定の呼び出し方がどう動くかは、この数値ではなくサンプルの契約が証明します。
| 環境 | 信頼度 | 観測 | 検証 | 成功率 | ピア | 最終観測 |
|---|---|---|---|---|---|---|
| unknown · Rust · cargo · linux glibc
観測: PROJECT_COMPILE 8✓ 26✕ · PROJECT_PROCESS 68✓ · PROJECT_TEST 1✓ — 使用: USED 4✓ — 検証: UNKNOWN 0✓ 1✕
|
ELEVATED FAILURE | 103 +4 | 1 | 74% | 1 | 2026-10-09 |
| rust 1 · Rust · cargo · linux musl · docker
使用: USED 4✓
|
LOW | 0 +4 | 0 | — | 1 | 2026-10-09 |
最近の失敗クラスター
-
観測済み PROJECT_COMPILE exit 101 ×5 0.8.3 os=linux sha256:113664d7d918…error: could not compile `probe_icu` (bin <str>) due to 1 previous errorrust/rustc · compiler-diagnostic · outer cargo run証拠品質: complete · 環境バリアント: 1 · 初回記録: 2026-09-20 · 最終観測: 2026-09-20
-
観測済み PROJECT_COMPILE exit 101 E0599 ×2 0.8.3 os=linux sha256:2b5f9f03ee2f…error[E0599]: no method named `get_set_for_value` found for struct `CodePointMapDataBorrowed<'a, T>` in the current scoperust/rustc · compiler-diagnostic · outer cargo run証拠品質: complete · 環境バリアント: 1 · 初回記録: 2026-09-19 · 最終観測: 2026-09-20
-
観測済み PROJECT_COMPILE exit 101 ×2 0.8.3 os=linux sha256:402a59d53b18…error: could not compile `test-cargo` (bin <str>) due to 1 previous errorrust/rustc · compiler-diagnostic · outer cargo run証拠品質: complete · 環境バリアント: 1 · 初回記録: 2026-09-20 · 最終観測: 2026-09-20
-
観測済み PROJECT_COMPILE exit 101 E0277 ×1 0.8.3 os=linux sha256:0f120d64ab10…error[E0277]: the trait bound `u8: From<GeneralCategory>` is not satisfiedrust/rustc · compiler-diagnostic · outer cargo run証拠品質: complete · 環境バリアント: 1 · 初回記録: 2026-09-20 · 最終観測: 2026-09-20
-
観測済み PROJECT_COMPILE exit 101 E0599 ×1 0.8.3 os=linux sha256:0fbd73add053…error[E0599]: no method named `is_empty` found for struct `Char16Trie<'data>` in the current scoperust/rustc · compiler-diagnostic · outer cargo run証拠品質: complete · 環境バリアント: 1 · 初回記録: 2026-09-20 · 最終観測: 2026-09-20
-
観測済み PROJECT_COMPILE exit 101 E0599 ×1 0.8.3 os=linux sha256:16d23d1801b1…error[E0599]: no method named `normalize` found for struct `ComposingNormalizer` in the current scoperust/rustc · compiler-diagnostic · outer cargo run証拠品質: complete · 環境バリアント: 1 · 初回記録: 2026-09-20 · 最終観測: 2026-09-20
-
観測済み PROJECT_COMPILE exit 101 ×1 0.8.3 os=linux sha256:233e69cc0ea0…error: could not compile `test-prop` (bin <str>) due to 2 previous errorsrust/rustc · compiler-diagnostic · outer cargo run証拠品質: complete · 環境バリアント: 1 · 初回記録: 2026-09-20 · 最終観測: 2026-09-20
-
観測済み PROJECT_COMPILE exit 101 E0599 ×1 0.8.3 os=linux sha256:267702ebcc26…error[E0599]: no associated function or constant named `new_nfc_unstable` found for struct `ComposingNormalizer` in the current scoperust/rustc · compiler-diagnostic · outer cargo run証拠品質: complete · 環境バリアント: 1 · 初回記録: 2026-09-20 · 最終観測: 2026-09-20
-
観測済み PROJECT_COMPILE exit 101 E0609 ×1 0.8.3 os=linux sha256:463107715912…error[E0609]: no field `SINGLETON_NORMALIZER_NFC_V1` on type `MyProvider`rust/rustc · compiler-diagnostic · outer cargo run証拠品質: complete · 環境バリアント: 1 · 初回記録: 2026-09-20 · 最終観測: 2026-09-20
-
観測済み PROJECT_COMPILE exit 101 ×1 0.8.3 os=linux sha256:5ee7225f0fbd…error: could not compile `sample-icu-properties` (bin <str>) due to 1 previous errorrust/rustc · compiler-diagnostic · outer cargo run証拠品質: complete · 環境バリアント: 1 · 初回記録: 2026-09-20 · 最終観測: 2026-09-20
-
観測済み PROJECT_COMPILE exit 101 E0597 ×1 0.8.3 os=linux sha256:61047e2c2906…error[E0597]: `gc_owned` does not live long enoughrust/rustc · compiler-diagnostic · outer cargo run証拠品質: complete · 環境バリアント: 1 · 初回記録: 2026-09-20 · 最終観測: 2026-09-20
-
観測済み PROJECT_COMPILE exit 101 E0599 ×1 0.8.3 os=linux sha256:780bb54cf72f…error[E0599]: no method named `as_borrowed` found for struct `CodePointSetDataBorrowed<'a>` in the current scoperust/rustc · compiler-diagnostic · outer cargo run証拠品質: complete · 環境バリアント: 1 · 初回記録: 2026-09-20 · 最終観測: 2026-09-20
最も多く報告された 12 件を表示しています。この座標に記録された失敗クラスタは 21 件です。残りは単発の報告です。
シンボル
エビデンスのあるシンボルはまだありません。