Записиcargowrite161.0.0
Детали окружения
Наблюдения уровня проекта и проверки символов/контрактов считаются раздельно и никогда не суммируются.
Эти числа не различают, как именно был вызван символ: перегрузки, наборы аргументов и опции считаются вместе. Что делает конкретная форма вызова, доказывает контракт образца, а не эти цифры.
| Окружение | Достоверность | Наблюдения | Проверено | Доля успешных | Пиры | Последнее наблюдение |
|---|---|---|---|---|---|---|
| unknown · Rust · cargo · linux glibc
Наблюдения: PROJECT_COMPILE 5✓ 13✕ · PROJECT_PROCESS 15✓
|
ELEVATED FAILURE | 33 | 0 | 61 % | 1 | 2026-09-20 |
Недавние кластеры сбоев
-
наблюдалось PROJECT_COMPILE exit 101 ×5 1.0.0 os=linux sha256:113664d7d918…error: could not compile `probe_icu` (bin <str>) due to 1 previous errorrust/rustc · compiler-diagnostic · outer cargo runКачество данных: complete · Варианты среды: 1 · Первая запись: 2026-09-20 · Последнее наблюдение: 2026-09-20
-
наблюдалось PROJECT_COMPILE exit 101 E0599 ×1 1.0.0 os=linux sha256:0fbd73add053…error[E0599]: no method named `is_empty` found for struct `Char16Trie<'data>` in the current scoperust/rustc · compiler-diagnostic · outer cargo runКачество данных: complete · Варианты среды: 1 · Первая запись: 2026-09-20 · Последнее наблюдение: 2026-09-20
-
наблюдалось PROJECT_COMPILE exit 101 E0599 ×1 1.0.0 os=linux sha256:16d23d1801b1…error[E0599]: no method named `normalize` found for struct `ComposingNormalizer` in the current scoperust/rustc · compiler-diagnostic · outer cargo runКачество данных: complete · Варианты среды: 1 · Первая запись: 2026-09-20 · Последнее наблюдение: 2026-09-20
-
наблюдалось PROJECT_COMPILE exit 101 E0599 ×1 1.0.0 os=linux sha256:267702ebcc26…error[E0599]: no associated function or constant named `new_nfc_unstable` found for struct `ComposingNormalizer` in the current scoperust/rustc · compiler-diagnostic · outer cargo runКачество данных: complete · Варианты среды: 1 · Первая запись: 2026-09-20 · Последнее наблюдение: 2026-09-20
-
наблюдалось PROJECT_COMPILE exit 101 E0609 ×1 1.0.0 os=linux sha256:463107715912…error[E0609]: no field `SINGLETON_NORMALIZER_NFC_V1` on type `MyProvider`rust/rustc · compiler-diagnostic · outer cargo runКачество данных: complete · Варианты среды: 1 · Первая запись: 2026-09-20 · Последнее наблюдение: 2026-09-20
-
наблюдалось PROJECT_COMPILE exit 101 E0433 ×1 1.0.0 os=linux sha256:7bbcaadcc1f2…error[E0433]: cannot find type `ComposingNormalizer` in this scope · error[E0433]: cannot find type `DecomposingNormalizer` in this scoperust/rustc · compiler-diagnostic · outer cargo runКачество данных: complete · Варианты среды: 1 · Первая запись: 2026-09-19 · Последнее наблюдение: 2026-09-19
-
наблюдалось PROJECT_COMPILE exit 101 ×1 1.0.0 os=linux sha256:8c4397747de8…error: could not compile `test_norm` (bin <str>) due to 5 previous errors; 1 warning emittedrust/rustc · compiler-diagnostic · outer cargo runКачество данных: complete · Варианты среды: 1 · Первая запись: 2026-09-19 · Последнее наблюдение: 2026-09-19
-
наблюдалось PROJECT_COMPILE exit 101 E0599 ×1 1.0.0 os=linux sha256:f2e8d63411fa…error[E0599]: no method named `get` found for struct `CanonicalCombiningClassMapBorrowed<'a>` in the current scoperust/rustc · compiler-diagnostic · outer cargo runКачество данных: complete · Варианты среды: 1 · Первая запись: 2026-09-19 · Последнее наблюдение: 2026-09-19
-
наблюдалось PROJECT_COMPILE exit 101 E0599 ×1 1.0.0 os=linux sha256:f752258b26cc…error[E0599]: no method named `as_bytes` found for reference `&Char16Trie<'_>` in the current scoperust/rustc · compiler-diagnostic · outer cargo runКачество данных: complete · Варианты среды: 1 · Первая запись: 2026-09-20 · Последнее наблюдение: 2026-09-20
Символы
Пока нет символов со свидетельствами.