기록cargoutf16_iter1.0.5
조건 변경
현재 조건
utf16_iter @1.0.5ubuntu glibc · x64 · cargo 1
API가 아니라 패키지 전체 집계
33회 중 20회 통과
관측 — 실제 프로젝트 빌드가 이 좌표에서 보고되었습니다.
이 좌표에는 아직 샘플이 없음
- 프로젝트 관측
- 20 / 33
- 컨트랙트 검증
- 이 좌표에는 없음
- 독립 보고 peer
- 1
- 마지막 기록
- 2026-09-20
열어 볼 수 있는 증거
의존성 건강도
어떤 해결 과정이 이 릴리스의 트리를 읽었고 의존성이 없었습니다. 빠진 것이 아니라 측정된 것입니다.
최근 실패 클러스터
-
관측됨 PROJECT_COMPILE exit 101 ×5 1.0.5 os=linux sha256:113664d7d918…error: could not compile `probe_icu` (bin <str>) due to 1 previous errorrust/rustc · compiler-diagnostic · outer cargo run증거 품질: complete · 환경 변형: 1 · 최초 관측: 2026-09-20 · 마지막 관측: 2026-09-20
-
관측됨 PROJECT_COMPILE exit 101 E0599 ×1 1.0.5 os=linux sha256:0fbd73add053…error[E0599]: no method named `is_empty` found for struct `Char16Trie<'data>` in the current scoperust/rustc · compiler-diagnostic · outer cargo run증거 품질: complete · 환경 변형: 1 · 최초 관측: 2026-09-20 · 마지막 관측: 2026-09-20
-
관측됨 PROJECT_COMPILE exit 101 E0599 ×1 1.0.5 os=linux sha256:16d23d1801b1…error[E0599]: no method named `normalize` found for struct `ComposingNormalizer` in the current scoperust/rustc · compiler-diagnostic · outer cargo run증거 품질: complete · 환경 변형: 1 · 최초 관측: 2026-09-20 · 마지막 관측: 2026-09-20
-
관측됨 PROJECT_COMPILE exit 101 E0599 ×1 1.0.5 os=linux sha256:267702ebcc26…error[E0599]: no associated function or constant named `new_nfc_unstable` found for struct `ComposingNormalizer` in the current scoperust/rustc · compiler-diagnostic · outer cargo run증거 품질: complete · 환경 변형: 1 · 최초 관측: 2026-09-20 · 마지막 관측: 2026-09-20
-
관측됨 PROJECT_COMPILE exit 101 E0609 ×1 1.0.5 os=linux sha256:463107715912…error[E0609]: no field `SINGLETON_NORMALIZER_NFC_V1` on type `MyProvider`rust/rustc · compiler-diagnostic · outer cargo run증거 품질: complete · 환경 변형: 1 · 최초 관측: 2026-09-20 · 마지막 관측: 2026-09-20
-
관측됨 PROJECT_COMPILE exit 101 E0433 ×1 1.0.5 os=linux sha256:7bbcaadcc1f2…error[E0433]: cannot find type `ComposingNormalizer` in this scope · error[E0433]: cannot find type `DecomposingNormalizer` in this scoperust/rustc · compiler-diagnostic · outer cargo run증거 품질: complete · 환경 변형: 1 · 최초 관측: 2026-09-19 · 마지막 관측: 2026-09-19
-
관측됨 PROJECT_COMPILE exit 101 ×1 1.0.5 os=linux sha256:8c4397747de8…error: could not compile `test_norm` (bin <str>) due to 5 previous errors; 1 warning emittedrust/rustc · compiler-diagnostic · outer cargo run증거 품질: complete · 환경 변형: 1 · 최초 관측: 2026-09-19 · 마지막 관측: 2026-09-19
-
관측됨 PROJECT_COMPILE exit 101 E0599 ×1 1.0.5 os=linux sha256:f2e8d63411fa…error[E0599]: no method named `get` found for struct `CanonicalCombiningClassMapBorrowed<'a>` in the current scoperust/rustc · compiler-diagnostic · outer cargo run증거 품질: complete · 환경 변형: 1 · 최초 관측: 2026-09-19 · 마지막 관측: 2026-09-19
-
관측됨 PROJECT_COMPILE exit 101 E0599 ×1 1.0.5 os=linux sha256:f752258b26cc…error[E0599]: no method named `as_bytes` found for reference `&Char16Trie<'_>` in the current scoperust/rustc · compiler-diagnostic · outer cargo run증거 품질: complete · 환경 변형: 1 · 최초 관측: 2026-09-20 · 마지막 관측: 2026-09-20