Aufzeichnungencargountrusted0.9.0
Umgebungsdetails
Beobachtungen auf Projektebene und Symbol-/Contract-Verifizierungen werden getrennt gezählt und niemals zusammengerechnet.
Diese Zahlen unterscheiden nicht, wie das Symbol aufgerufen wurde: Überladungen, Argumentformen und Optionen werden zusammengefasst. Was eine bestimmte Aufrufform tut, beweist der Vertrag eines Samples – nicht diese Zahlen.
| Umgebung | Konfidenz | Beobachtungen | Verifiziert | Erfolgsquote | Peers | Zuletzt gesehen |
|---|---|---|---|---|---|---|
| unknown · Rust · cargo · linux glibc
Beobachtungen: PROJECT_COMPILE 1✓ 11✕ · PROJECT_PROCESS 13✓ · PROJECT_TEST 1✓ — Nutzung: USED 1✓ — Verifiziert: UNKNOWN 0✓ 2✕
|
ELEVATED FAILURE | 26 +1 | 2 | 54 % | 1 | 2026-10-09 |
Aktuelle Fehler-Cluster
-
beobachtet PROJECT_COMPILE exit 101 E0616 ×2 0.9.0 os=linux sha256:581c58c1c7ac…error[E0616]: field `output_len` of struct `ring::digest::Algorithm` is privaterust/rustc · compiler-diagnostic · outer cargo run, cargo testBeweisqualität: complete · Umgebungsvarianten: 1 · Zuerst erfasst: 2026-09-20 · Zuletzt gesehen: 2026-09-20
-
beobachtet PROJECT_COMPILE exit 101 ×1 0.9.0 os=linux sha256:104f536c9704…error: could not compile `probe` (bin <str>) due to 2 previous errorsrust/rustc · compiler-diagnostic · outer cargo runBeweisqualität: complete · Umgebungsvarianten: 1 · Zuerst erfasst: 2026-09-19 · Zuletzt gesehen: 2026-09-19
-
beobachtet PROJECT_COMPILE exit 101 ×1 0.9.0 os=linux sha256:24ec7982ffbe…error: could not compile `test-ring` (bin <str>) due to 1 previous errorrust/rustc · compiler-diagnostic · outer cargo runBeweisqualität: complete · Umgebungsvarianten: 1 · Zuerst erfasst: 2026-09-20 · Zuletzt gesehen: 2026-09-20
-
beobachtet PROJECT_COMPILE exit 101 E0599 ×1 0.9.0 os=linux sha256:5b0ef21330f9…error[E0599]: no associated function or constant named `SERVER_AUTH` found for struct `KeyPurposeId<'a>` in the current scoperust/rustc · compiler-diagnostic · outer cargo checkBeweisqualität: complete · Umgebungsvarianten: 1 · Zuerst erfasst: 2026-09-19 · Zuletzt gesehen: 2026-09-19
-
beobachtet PROJECT_COMPILE exit 101 ×1 0.9.0 os=linux sha256:5ef222f665b3…error: could not compile `sample-ring-digest` (bin <str>) due to 2 previous errorsrust/rustc · compiler-diagnostic · outer cargo runBeweisqualität: complete · Umgebungsvarianten: 1 · Zuerst erfasst: 2026-09-20 · Zuletzt gesehen: 2026-09-20
-
beobachtet PROJECT_COMPILE exit 101 E0599 ×1 0.9.0 os=linux sha256:8c25141af213…error[E0599]: no variant, associated function, or constant named `CACompromise` found for enum `webpki::RevocationReason` in the current scoperust/rustc · compiler-diagnostic · outer cargo runBeweisqualität: complete · Umgebungsvarianten: 1 · Zuerst erfasst: 2026-09-19 · Zuletzt gesehen: 2026-09-19
-
beobachtet PROJECT_COMPILE exit 101 E0423 ×1 0.9.0 os=linux sha256:a4ccb879052a…error[E0423]: cannot initialize a tuple struct which contains private fieldsrust/rustc · compiler-diagnostic · outer cargo runBeweisqualität: complete · Umgebungsvarianten: 1 · Zuerst erfasst: 2026-09-19 · Zuletzt gesehen: 2026-09-19
-
beobachtet PROJECT_COMPILE exit 101 ×1 0.9.0 os=linux sha256:b7a3fa5852a8…error: could not compile `ring-digest-test` (lib test) due to 1 previous error; 1 warning emittedrust/rustc · compiler-diagnostic · outer cargo testBeweisqualität: complete · Umgebungsvarianten: 1 · Zuerst erfasst: 2026-09-20 · Zuletzt gesehen: 2026-09-20
-
beobachtet PROJECT_COMPILE exit 101 ×1 0.9.0 os=linux sha256:d5a10aa5fcc7…error: could not compile `probe` (bin <str>) due to 1 previous errorrust/rustc · compiler-diagnostic · outer cargo checkBeweisqualität: complete · Umgebungsvarianten: 1 · Zuerst erfasst: 2026-09-19 · Zuletzt gesehen: 2026-09-19
-
beobachtet PROJECT_COMPILE exit 101 E0599 ×1 0.9.0 os=linux sha256:ddd135697656…error[E0599]: no method named `public_key` found for struct `Ed25519KeyPair` in the current scoperust/rustc · compiler-diagnostic · outer cargo runBeweisqualität: complete · Umgebungsvarianten: 1 · Zuerst erfasst: 2026-09-20 · Zuletzt gesehen: 2026-09-20
-
beobachtet UNKNOWN exit 101 Beweislücke ×1 0.9.0 os=linux sha256:58d2cf0f1acc…Compiling sample-ring-digest v1.0.0 (<path> · Finished `dev` profile [unoptimized + debuginfo] target(s) in 0.18s · Running `target/debug/contract` …cargo · unclassified-diagnostic · outer cargo run · gap stage-unknownBeweisqualität: complete · Umgebungsvarianten: 1 · Zuerst erfasst: 2026-09-20 · Zuletzt gesehen: 2026-09-20Kandidat für diagnostische Neuprüfung
-
beobachtet UNKNOWN exit 101 Beweislücke ×1 0.9.0 os=linux sha256:a3999c200a2d…Compiling sample-ring v1.0.0 (<path> · warning: unused import: `self` · --> test/contract.rs:<n>:<n> · |cargo · unclassified-diagnostic · outer cargo run · gap stage-unknownBeweisqualität: complete · Umgebungsvarianten: 1 · Zuerst erfasst: 2026-09-19 · Zuletzt gesehen: 2026-09-19Kandidat für diagnostische Neuprüfung
Symbole
Noch keine Symbole mit Evidenz.