기록cargounicode-ident1.0.27
조건 변경
현재 조건
unicode-ident @1.0.27ubuntu glibc · x64 · cargo 1
API가 아니라 패키지 전체 집계
11회 중 0회 통과
검증 — 이 네트워크가 이 좌표에서 컨트랙트를 직접 실행했습니다.
샘플 있음 — 이 좌표에서 우리가 실행했고 실패함
- 프로젝트 관측
- 33 / 52
- 컨트랙트 검증
- 0 / 11
- 사용 기록
- 1
- 독립 보고 peer
- 1
- 마지막 기록
- 2026-10-19
열어 볼 수 있는 증거
의존성 건강도
어떤 해결 과정이 이 릴리스의 트리를 읽었고 의존성이 없었습니다. 빠진 것이 아니라 측정된 것입니다.
최근 실패 클러스터
-
관측됨 PROJECT_COMPILE exit 101 ×2 1.0.27 os=linux sha256:e461456111a7…error: could not compile `sample-zerocopy-immutable` (bin <str>) due to 1 previous errorrust/rustc · compiler-diagnostic · outer cargo run증거 품질: complete · 환경 변형: 1 · 최초 관측: 2026-10-16 · 마지막 관측: 2026-10-16
-
관측됨 UNKNOWN exit 101 증거 공백 ×2 1.0.27 os=linux sha256:0a082b31ba29…Updating crates.io index · Locking 6 packages to latest compatible versions · Adding zerocopy v0.8.62 (available: v0.8.63) …cargo · unclassified-diagnostic · outer cargo run · gap stage-unknown증거 품질: complete · 환경 변형: 1 · 최초 관측: 2026-10-16 · 마지막 관측: 2026-10-16진단 재검증 후보
-
관측됨 UNKNOWN exit 101 증거 공백 ×2 1.0.27 os=linux sha256:8f78f52362b8…Updating crates.io index · Locking 7 packages to latest compatible versions · Adding wasm-bindgen-macro-support v0.2.128 (available: v0.2.129) …cargo · unclassified-diagnostic · outer cargo run · gap stage-unknown증거 품질: complete · 환경 변형: 1 · 최초 관측: 2026-10-17 · 마지막 관측: 2026-10-17진단 재검증 후보
-
관측됨 PROJECT_TEST exit 101 ×2 1.0.27 os=linux sha256:4f232600c5a8…error: test failed, to rerun pass `--test contract` · running 0 tests …rust/test · test-runner-diagnostic · outer cargo test증거 품질: complete · 환경 변형: 1 · 최초 관측: 2026-10-18 · 마지막 관측: 2026-10-18
-
관측됨 PROJECT_COMPILE exit 101 E0599 ×1 1.0.27 os=linux sha256:259d35925fd1…error[E0599]: no associated function or constant named `new_zeroed` found for struct `Header` in the current scoperust/rustc · compiler-diagnostic · outer cargo test증거 품질: complete · 환경 변형: 1 · 최초 관측: 2026-10-16 · 마지막 관측: 2026-10-16
-
관측됨 PROJECT_COMPILE exit 101 ×1 1.0.27 os=linux sha256:623172eb9244…error: could not compile `sample` (bin <str> test) due to 1 previous errorrust/rustc · compiler-diagnostic · outer cargo test증거 품질: complete · 환경 변형: 1 · 최초 관측: 2026-10-16 · 마지막 관측: 2026-10-16
-
관측됨 PROJECT_COMPILE exit 101 E0505 ×1 1.0.27 os=linux sha256:cbcd51a513e3…error[E0505]: cannot move out of `header` because it is borrowedrust/rustc · compiler-diagnostic · outer cargo run증거 품질: complete · 환경 변형: 1 · 최초 관측: 2026-10-16 · 마지막 관측: 2026-10-16
-
관측됨 PROJECT_COMPILE exit 101 E0277 ×1 1.0.27 os=linux sha256:e5387c1d1a4b…error[E0277]: the trait bound `T: KnownLayout` is not satisfiedrust/rustc · compiler-diagnostic · outer cargo run증거 품질: complete · 환경 변형: 1 · 최초 관측: 2026-10-16 · 마지막 관측: 2026-10-16
-
관측됨 PROJECT_COMPILE exit 101 E0599 ×1 1.0.27 os=linux sha256:0d0e9d01775d…error[E0599]: no method named `zero` found for struct `PacketHeader` in the current scoperust/rustc · compiler-diagnostic · outer cargo run증거 품질: complete · 환경 변형: 1 · 최초 관측: 2026-10-16 · 마지막 관측: 2026-10-16
-
관측됨 PROJECT_COMPILE exit 101 E0277 ×1 1.0.27 os=linux sha256:0f9e25b7a406…error[E0277]: the trait bound `PacketHeader: FromBytes` is not satisfiedrust/rustc · compiler-diagnostic · outer cargo run증거 품질: complete · 환경 변형: 1 · 최초 관측: 2026-10-16 · 마지막 관측: 2026-10-16
-
관측됨 PROJECT_COMPILE exit 101 ×1 1.0.27 os=linux sha256:36117b64532a…error: could not compile `sample-zerocopy-intobytes` (bin <str>) due to 2 previous errorsrust/rustc · compiler-diagnostic · outer cargo run증거 품질: complete · 환경 변형: 1 · 최초 관측: 2026-10-16 · 마지막 관측: 2026-10-16
-
관측됨 PROJECT_COMPILE exit 101 ×1 1.0.27 os=linux sha256:413e0f6a3ea0…error: could not compile `sample-zerocopy-frombytes` (bin <str>) due to 2 previous errorsrust/rustc · compiler-diagnostic · outer cargo run증거 품질: complete · 환경 변형: 1 · 최초 관측: 2026-10-16 · 마지막 관측: 2026-10-16
가장 많이 보고된 12개를 보여줍니다. 이 좌표에 기록된 실패 클러스터는 26개입니다. 나머지는 단발 보고입니다.