記録cargounicode-ident1.0.25
環境の詳細
プロジェクトレベルの観測とシンボル/コントラクト検証は別々に集計し、決して合算しません。
これらの数値は、シンボルがどう呼び出されたかを区別しません。オーバーロード、引数の形、オプションはまとめて集計されます。特定の呼び出し方がどう動くかは、この数値ではなくサンプルの契約が証明します。
| 環境 | 信頼度 | 観測 | 検証 | 成功率 | ピア | 最終観測 |
|---|---|---|---|---|---|---|
| unknown · Rust · cargo · linux glibc
観測: PROJECT_COMPILE 0✓ 3✕ · PROJECT_PROCESS 5✓ · PROJECT_TEST 3✓
|
ELEVATED FAILURE | 11 | 0 | 73% | 1 | 2026-09-17 |
最近の失敗クラスター
-
観測済み PROJECT_COMPILE exit 101 E0308 ×1 1.0.25 os=linux sha256:0479254218ac…error[E0308]: mismatched typesrust/rustc · compiler-diagnostic · outer cargo test証拠品質: complete · 環境バリアント: 1 · 初回記録: 2026-09-16 · 最終観測: 2026-09-16
-
観測済み PROJECT_COMPILE exit 101 E0433 ×1 1.0.25 os=linux sha256:76da7807743b…error[E0433]: cannot find `pin` in `tokio` · error[E0433]: cannot find `pin` in `tokio_macros_sample`rust/rustc · compiler-diagnostic · outer cargo test証拠品質: complete · 環境バリアント: 1 · 初回記録: 2026-09-16 · 最終観測: 2026-09-16
-
観測済み PROJECT_COMPILE exit 101 ×1 1.0.25 os=linux sha256:ddfcd6108cf7…error: could not compile `tokio_macros_sample` (test <str>) due to 6 previous errorsrust/rustc · compiler-diagnostic · outer cargo test証拠品質: complete · 環境バリアント: 1 · 初回記録: 2026-09-16 · 最終観測: 2026-09-16
シンボル
エビデンスのあるシンボルはまだありません。