Relevéscargotwox-hash2.1.5
Détail de l'environnement
Les observations au niveau projet et les vérifications de symbole/contrat sont comptées séparément et jamais additionnées.
Ces chiffres ne distinguent pas la façon dont le symbole a été appelé : surcharges, formes d'arguments et options sont regroupées. Ce que fait une forme d'appel précise est prouvé par le contrat d'un échantillon, pas par ces nombres.
| Environnement | Confiance | Observations | Vérifié | Taux de réussite | Pairs | Dernière observation |
|---|---|---|---|---|---|---|
| unknown · Rust · cargo · linux glibc
Observations: PROJECT_COMPILE 1✓ 5✕ · PROJECT_PROCESS 8✓ · PROJECT_TEST 5✓ 3✕
|
ELEVATED FAILURE | 22 | 0 | 64 % | 1 | 2026-10-20 |
Clusters d'échecs récents
-
observé PROJECT_TEST exit 101 ×2 2.1.5 os=linux sha256:4f232600c5a8…error: test failed, to rerun pass `--test contract` · running 0 tests …rust/test · test-runner-diagnostic · outer cargo testQualité de preuve: complete · Variantes d’environnement: 1 · Premier relevé: 2026-10-20 · Dernière observation: 2026-10-20
-
observé PROJECT_COMPILE exit 101 ×1 2.1.5 os=linux sha256:aaf1990e27c5…error: could not compile `sample-addr2line` (test <str>) due to 2 previous errors …rust/rustc · compiler-diagnostic · outer cargo testQualité de preuve: complete · Variantes d’environnement: 1 · Premier relevé: 2026-10-19 · Dernière observation: 2026-10-19
-
observé PROJECT_COMPILE exit 101 E0432 ×1 2.1.5 os=linux sha256:ac7324fdd333…error[E0432]: unresolved import `addr2line::object`rust/rustc · compiler-diagnostic · outer cargo testQualité de preuve: complete · Variantes d’environnement: 1 · Premier relevé: 2026-10-19 · Dernière observation: 2026-10-19
-
observé PROJECT_COMPILE exit 101 E0599 ×1 2.1.5 os=linux sha256:ff95f88fed26…error[E0599]: no associated function or constant named `new` found for struct `addr2line::Context<R>` in the current scoperust/rustc · compiler-diagnostic · outer cargo testQualité de preuve: complete · Variantes d’environnement: 1 · Premier relevé: 2026-10-19 · Dernière observation: 2026-10-19
-
observé PROJECT_TEST exit 101 E0432 ×1 2.1.5 os=linux sha256:c4faf3580ad8…34 | let ctx = Context::new(&obj_file).expect(<str>); · | ^^^ associated function or constant not found in `addr2line::Context<_>` · | …rust/test · test-runner-diagnostic · outer cargo testQualité de preuve: complete · Variantes d’environnement: 1 · Premier relevé: 2026-10-19 · Dernière observation: 2026-10-19
-
observé PROJECT_COMPILE exit 101 E0308 ×1 2.1.5 os=linux sha256:0479254218ac…error[E0308]: mismatched typesrust/rustc · compiler-diagnostic · outer cargo runQualité de preuve: complete · Variantes d’environnement: 1 · Premier relevé: 2026-10-19 · Dernière observation: 2026-10-19
-
observé PROJECT_COMPILE exit 101 ×1 2.1.5 os=linux sha256:4c786cbbce8a…error: could not compile `sample` (bin <str>) due to 1 previous errorrust/rustc · compiler-diagnostic · outer cargo runQualité de preuve: complete · Variantes d’environnement: 1 · Premier relevé: 2026-10-19 · Dernière observation: 2026-10-19
Symboles
Pas encore de symboles avec des preuves.