Registroscargotokio-macros2.7.2tokio_macros::main
Cambiar las condiciones
Condiciones actuales
tokio_macros::main @2.7.2ubuntu glibc · x64 · cargo 1
4 de 7 pasaron
Observado: builds reales de proyectos reportaron desde esta coordenada.
hay una muestra aquí y todavía no la hemos ejecutado en esta coordenada (1)
- Observaciones de proyectos
- 4 / 7
- Verificaciones de contrato
- nada en esta coordenada
- Peers independientes que reportaron
- 1
- Último registro
- 2026-09-16
Salud de dependencias
Combinaciones observadas y evidencia de fallos para esta versión
Primer fallo observado
2.7.2
linux
1 FAIL
· stage: PROJECT_COMPILE
· fingerprint: sha256:0479254218ac3780b34745e946705b5f6ea072bc45cc7771f5a9b6fbfb5955e8
| Biblioteca | Versión | Estado | Medido allí | Proyectos |
|---|---|---|---|---|
| syn | 3.0.3 | CANDIDATE Cambio correlacionado; combinación no probada | contrato aprobado | 10 días-proyecto |
| syn | 3.0.5 | CANDIDATE Cambio correlacionado; combinación no probada | contrato aprobado | 2 días-proyecto |
| proc-macro2 | 1.0.107 | PASS Todas las observaciones pasaron | contrato aprobado | 12 días-proyecto |
| quote | 1.0.47 | PASS Todas las observaciones pasaron | contrato aprobado | 12 días-proyecto |
La columna de medición se refiere a la versión de cada dependencia en sí, no al par. Que un resolutor haya colocado dos versiones juntas no prueba que funcionen juntas.
Versiones de dependencias por versión
A qué resolvió sus hijos cada versión de este paquete. Primero va el hijo cuya versión se movió: ahí una actualización cambió algo bajo tus pies.
Se movieron: 1 · iguales en todas las versiones: 2
Una arista registra que un resolutor colocó una versión junto a otra en una máquina real. No afirma que ambas funcionen juntas; a esa pregunta responden las muestras y los contratos, no la presencia de una fila.
Clústeres de fallos recientes
-
observado PROJECT_COMPILE exit 101 E0308 ×1 2.7.2 os=linux tokio_macros::main sha256:0479254218ac…error[E0308]: mismatched typesrust/rustc · compiler-diagnostic · outer cargo testCalidad de evidencia: complete · Variantes de entorno: 1 · Primer registro: 2026-09-16 · Última observación: 2026-09-16
-
observado PROJECT_COMPILE exit 101 E0433 ×1 2.7.2 os=linux tokio_macros::main sha256:76da7807743b…error[E0433]: cannot find `pin` in `tokio` · error[E0433]: cannot find `pin` in `tokio_macros_sample`rust/rustc · compiler-diagnostic · outer cargo testCalidad de evidencia: complete · Variantes de entorno: 1 · Primer registro: 2026-09-16 · Última observación: 2026-09-16
-
observado PROJECT_COMPILE exit 101 ×1 2.7.2 os=linux tokio_macros::main sha256:ddfcd6108cf7…error: could not compile `tokio_macros_sample` (test <str>) due to 6 previous errorsrust/rustc · compiler-diagnostic · outer cargo testCalidad de evidencia: complete · Variantes de entorno: 1 · Primer registro: 2026-09-16 · Última observación: 2026-09-16