Registroscargotokio-macros2.7.2tokio_macros::test
Mudar as condições
Condições atuais
tokio_macros::test @2.7.2ubuntu glibc · x64 · cargo 1
4 de 7 passaram
Observado — builds reais de projetos reportaram desta coordenada.
há uma amostra aqui e ainda não a executamos nesta coordenada (1)
- Observações de projetos
- 4 / 7
- Verificações de contrato
- nada nesta coordenada
- Peers independentes que reportaram
- 1
- Último registro
- 2026-09-16
Saúde das dependências
Combinações observadas e evidências de falha para esta versão
Primeira quebra observada
2.7.2
linux
1 FAIL
· stage: PROJECT_COMPILE
· fingerprint: sha256:0479254218ac3780b34745e946705b5f6ea072bc45cc7771f5a9b6fbfb5955e8
| Biblioteca | Versão | Saúde | Medido ali | Projetos |
|---|---|---|---|---|
| syn | 3.0.3 | CANDIDATE Mudança correlacionada; combinação não comprovada | contrato aprovado | 10 dias-projeto |
| syn | 3.0.5 | CANDIDATE Mudança correlacionada; combinação não comprovada | contrato aprovado | 2 dias-projeto |
| proc-macro2 | 1.0.107 | PASS Todas as observações passaram | contrato aprovado | 12 dias-projeto |
| quote | 1.0.47 | PASS Todas as observações passaram | contrato aprovado | 12 dias-projeto |
A coluna de medição é sobre a versão de cada dependência em si, não sobre o par. Um resolvedor ter colocado duas versões lado a lado não é prova de que funcionam juntas.
Versões de dependências por versão
Para que cada versão deste pacote resolveu seus filhos. O filho cuja versão se moveu vem primeiro: foi ali que uma atualização mudou algo sob os seus pés.
Moveram-se: 1 · iguais em todas as versões: 2
Uma aresta registra que um resolvedor colocou uma versão ao lado de outra em uma máquina real. Não é uma afirmação de que as duas funcionam juntas; essa pergunta é respondida por amostras e contratos, não pela presença de uma linha.
Clusters de falha recentes
-
observado PROJECT_COMPILE exit 101 E0308 ×1 2.7.2 os=linux tokio_macros::test sha256:0479254218ac…error[E0308]: mismatched typesrust/rustc · compiler-diagnostic · outer cargo testQualidade da evidência: complete · Variantes de ambiente: 1 · Primeiro registro: 2026-09-16 · Visto por último: 2026-09-16
-
observado PROJECT_COMPILE exit 101 E0433 ×1 2.7.2 os=linux tokio_macros::test sha256:76da7807743b…error[E0433]: cannot find `pin` in `tokio` · error[E0433]: cannot find `pin` in `tokio_macros_sample`rust/rustc · compiler-diagnostic · outer cargo testQualidade da evidência: complete · Variantes de ambiente: 1 · Primeiro registro: 2026-09-16 · Visto por último: 2026-09-16
-
observado PROJECT_COMPILE exit 101 ×1 2.7.2 os=linux tokio_macros::test sha256:ddfcd6108cf7…error: could not compile `tokio_macros_sample` (test <str>) due to 6 previous errorsrust/rustc · compiler-diagnostic · outer cargo testQualidade da evidência: complete · Variantes de ambiente: 1 · Primeiro registro: 2026-09-16 · Visto por último: 2026-09-16