Записиcargotokio-macros2.7.2tokio_macros::test
Изменить условия
Текущие условия
tokio_macros::test @2.7.2ubuntu glibc · x64 · cargo 1
4 из 7 прошли
Наблюдение — реальные сборки проектов сообщили об этой координате.
образец есть — в этой координате мы его ещё не запускали (1)
- Наблюдения в проектах
- 4 / 7
- Проверки контрактом
- в этой координате ничего
- Независимые сообщившие пиры
- 1
- Последняя запись
- 2026-09-16
Здоровье зависимостей
Наблюдаемые комбинации и свидетельства сбоев для этого выпуска
Первый обнаруженный сбой
2.7.2
linux
1 FAIL
· stage: PROJECT_COMPILE
· fingerprint: sha256:0479254218ac3780b34745e946705b5f6ea072bc45cc7771f5a9b6fbfb5955e8
| Библиотека | Версия | Состояние | Измерено там | Проектов |
|---|---|---|---|---|
| syn | 3.0.3 | CANDIDATE Коррелированное изменение; комбинация не подтверждена | контракт пройден | 10 проектных дней |
| syn | 3.0.5 | CANDIDATE Коррелированное изменение; комбинация не подтверждена | контракт пройден | 2 проектных дня |
| proc-macro2 | 1.0.107 | PASS Все наблюдения прошли успешно | контракт пройден | 12 проектных дней |
| quote | 1.0.47 | PASS Все наблюдения прошли успешно | контракт пройден | 12 проектных дней |
Столбец измерения относится к релизу самой зависимости, а не к паре. То, что резолвер поставил два релиза рядом, не доказывает, что они работают вместе.
Версии зависимостей по выпускам
К чему каждый выпуск этого пакета разрешил своих потомков. Потомок, чья версия сдвинулась, идёт первым: там обновление изменило что-то под вами.
Сдвинулось: 1 · одинаково во всех выпусках: 2
Ребро фиксирует, что резолвер поставил один релиз рядом с другим на реальной машине. Это не утверждение, что они работают вместе; на этот вопрос отвечают образцы и контракты, а не наличие строки.
Недавние кластеры сбоев
-
наблюдалось PROJECT_COMPILE exit 101 E0308 ×1 2.7.2 os=linux tokio_macros::test sha256:0479254218ac…error[E0308]: mismatched typesrust/rustc · compiler-diagnostic · outer cargo testКачество данных: complete · Варианты среды: 1 · Первая запись: 2026-09-16 · Последнее наблюдение: 2026-09-16
-
наблюдалось PROJECT_COMPILE exit 101 E0433 ×1 2.7.2 os=linux tokio_macros::test sha256:76da7807743b…error[E0433]: cannot find `pin` in `tokio` · error[E0433]: cannot find `pin` in `tokio_macros_sample`rust/rustc · compiler-diagnostic · outer cargo testКачество данных: complete · Варианты среды: 1 · Первая запись: 2026-09-16 · Последнее наблюдение: 2026-09-16
-
наблюдалось PROJECT_COMPILE exit 101 ×1 2.7.2 os=linux tokio_macros::test sha256:ddfcd6108cf7…error: could not compile `tokio_macros_sample` (test <str>) due to 6 previous errorsrust/rustc · compiler-diagnostic · outer cargo testКачество данных: complete · Варианты среды: 1 · Первая запись: 2026-09-16 · Последнее наблюдение: 2026-09-16