记录cargosyn3.0.9
更改条件
依赖健康度
此版本的依赖组合与失败观测
观测到问题 1 项 ·
变动 1 项 ·
正常 2 项
| 库 | 版本 | 健康状态 | 在那里测得 | 项目 |
|---|---|---|---|---|
| unicode-ident | 1.0.27 | CANDIDATE 相关变更;组合未证实 | 契约通过 | 51 个项目日 |
| proc-macro2 | 1.0.107 | PASS 所有观测均通过 | 契约通过 | 52 个项目日 |
| quote | 1.0.47 | PASS 所有观测均通过 | 契约通过 | 52 个项目日 |
测量列说的是每个依赖自身版本的情况,而不是这一对的情况。解析器把两个版本放在一起,并不证明它们能协同工作。
各版本的依赖版本
本包的每个版本把子依赖解析到了哪个版本。版本发生变动的子依赖排在最前:升级正是在那里改变了你脚下的东西。
| 库 | 3.0.9 | 3.0.7 | 3.0.6 | 3.0.5 | 3.0.3 | 2.0.119 |
|---|---|---|---|---|---|---|
| unicode-ident | 1.0.27 | 1.0.26 | 1.0.25 | 1.0.25 | 1.0.26 | 1.0.25 |
| proc-macro2 | 1.0.107 | 1.0.107 | 1.0.107 | 1.0.107 | 1.0.107 | 1.0.107 |
| quote | 1.0.47 | 1.0.47 | 1.0.47 | 1.0.47 | 1.0.47 | 1.0.47 |
发生变动:1 · 所有版本相同:2
一条边记录的是解析器在真实机器上把一个版本放在了另一个版本旁边。它并不主张两者能协同工作;那个问题由样本和契约回答,而不是由这里存在一行来回答。
近期失败聚类
-
已观测 PROJECT_COMPILE exit 101 E0599 ×9 3.0.9 os=linux sha256:b07a18e8da2b…error[E0599]: no associated function or constant named `new` found for struct `Adapter` in the current scoperust/rustc · compiler-diagnostic · outer cargo build, cargo check, cargo run, cargo test证据质量: complete · 环境变体: 1 · 首次记录: 2026-10-19 · 最近观测: 2026-10-21
-
已观测 PROJECT_COMPILE exit 101 E0308 ×4 3.0.5 → 3.0.6 → 3.0.9 os=linux sha256:0479254218ac…error[E0308]: mismatched typesrust/rustc · compiler-diagnostic · outer cargo run, cargo test证据质量: complete · 环境变体: 1 · 首次记录: 2026-09-16 · 最近观测: 2026-10-21
-
已观测 PROJECT_COMPILE exit 101 ×4 3.0.9 os=linux sha256:4c786cbbce8a…error: could not compile `sample` (bin <str>) due to 1 previous errorrust/rustc · compiler-diagnostic · outer cargo run证据质量: complete · 环境变体: 1 · 首次记录: 2026-10-21 · 最近观测: 2026-10-21
-
已观测 PROJECT_COMPILE exit 101 ×3 3.0.9 os=linux sha256:6d7f0ce8254c…error: could not compile `sample-idna-adapter` (bin <str>) due to 1 previous errorrust/rustc · compiler-diagnostic · outer cargo build, cargo check证据质量: complete · 环境变体: 1 · 首次记录: 2026-10-19 · 最近观测: 2026-10-21
-
已观测 UNKNOWN exit 101 证据缺口 ×2 3.0.9 os=linux sha256:8f78f52362b8…Updating crates.io index · Locking 7 packages to latest compatible versions · Adding wasm-bindgen-macro-support v0.2.128 (available: v0.2.129) …cargo · unclassified-diagnostic · outer cargo run · gap stage-unknown证据质量: complete · 环境变体: 1 · 首次记录: 2026-10-17 · 最近观测: 2026-10-17诊断复验候选
-
已观测 PROJECT_COMPILE exit 101 ×1 3.0.9 os=linux sha256:92ea19e5526e…error: could not compile `sample-expand-class-marker` (bin <str>) due to 1 previous errorrust/rustc · compiler-diagnostic · outer cargo run证据质量: complete · 环境变体: 1 · 首次记录: 2026-10-17 · 最近观测: 2026-10-17
-
已观测 PROJECT_COMPILE exit 101 E0599 ×1 3.0.9 os=linux sha256:eaa7d8163513…error[E0599]: no method named `into_node` found for struct `wasm_bindgen_macro_support::error::Diagnostic` in the current scoperust/rustc · compiler-diagnostic · outer cargo run证据质量: complete · 环境变体: 1 · 首次记录: 2026-10-17 · 最近观测: 2026-10-17
-
已观测 UNKNOWN signal ABORTED 证据缺口 ×1 3.0.9 os=linux sha256:034c59ed23d6…Compiling sample-wasm-bindgen v0.1.0 (<path> · Finished `dev` profile [unoptimized + debuginfo] target(s) in 0.19s …cargo · unclassified-diagnostic · outer cargo run · gap stage-unknown证据质量: complete · 环境变体: 1 · 首次记录: 2026-10-17 · 最近观测: 2026-10-17诊断复验候选
-
已观测 UNKNOWN exit 101 证据缺口 ×1 3.0.9 os=linux sha256:38c7f7eae057…Compiling sample-expand-class-marker v0.1.0 (<path> · Finished `dev` profile [unoptimized + debuginfo] target(s) in 1.03s …cargo · unclassified-diagnostic · outer cargo run · gap stage-unknown证据质量: complete · 环境变体: 1 · 首次记录: 2026-10-17 · 最近观测: 2026-10-17诊断复验候选
-
已观测 UNKNOWN exit 101 证据缺口 ×1 3.0.9 os=linux sha256:3cad07d3a07c…Compiling sample-wasm-bindgen-macro-support v0.1.0 (<path> · Finished `dev` profile [unoptimized + debuginfo] target(s) in 0.53s …cargo · unclassified-diagnostic · outer cargo run · gap stage-unknown证据质量: complete · 环境变体: 1 · 首次记录: 2026-10-17 · 最近观测: 2026-10-17诊断复验候选
-
已观测 UNKNOWN exit 101 证据缺口 ×1 3.0.9 os=linux sha256:49fbc1f03025…Compiling sample-wasm-bindgen v0.1.0 (<path> · Finished `dev` profile [unoptimized + debuginfo] target(s) in 0.33s …cargo · unclassified-diagnostic · outer cargo run · gap stage-unknown证据质量: complete · 环境变体: 1 · 首次记录: 2026-10-17 · 最近观测: 2026-10-17诊断复验候选
-
已观测 UNKNOWN exit 101 证据缺口 ×1 3.0.9 os=linux sha256:ce88fa682bac…Updating crates.io index · Locking 12 packages to latest compatible versions · Adding wasm-bindgen v0.2.128 (available: v0.2.129) …cargo · unclassified-diagnostic · outer cargo run · gap stage-unknown证据质量: complete · 环境变体: 1 · 首次记录: 2026-10-17 · 最近观测: 2026-10-17诊断复验候选
显示报告最多的 12 个。此坐标记录的失败聚类共 23 个。其余为单次报告。