Registroscargosmallvec1.16.3
Detalhe do ambiente
Observações no nível do projeto e verificações de símbolo/contrato são contadas separadamente e nunca somadas.
Estas contagens não distinguem como o símbolo foi chamado: sobrecargas, formatos de argumentos e opções são agrupados. O que uma forma de chamada específica faz é provado pelo contrato de uma amostra, não por estes números.
| Ambiente | Confiança | Observações | Verificado | Taxa de aprovação | Peers | Visto por último |
|---|---|---|---|---|---|---|
| unknown · Rust · cargo · linux glibc
Observações: PROJECT_COMPILE 1✓ 9✕ · PROJECT_PROCESS 13✓ · PROJECT_TEST 5✓ 3✕ — Uso: USED 1✓
|
ELEVATED FAILURE | 31 +1 | 0 | 61% | 1 | 2026-10-20 |
Clusters de falha recentes
-
observado PROJECT_TEST exit 101 ×2 1.16.3 os=linux sha256:4f232600c5a8…error: test failed, to rerun pass `--test contract` · running 0 tests …rust/test · test-runner-diagnostic · outer cargo testQualidade da evidência: complete · Variantes de ambiente: 1 · Primeiro registro: 2026-10-20 · Visto por último: 2026-10-20
-
observado PROJECT_COMPILE exit 101 ×1 1.16.3 os=linux sha256:5f8e4e2b88b7…error: could not compile `sample-idna-adapter` (bin <str>) due to 2 previous errorsrust/rustc · compiler-diagnostic · outer cargo runQualidade da evidência: complete · Variantes de ambiente: 1 · Primeiro registro: 2026-10-19 · Visto por último: 2026-10-19
-
observado PROJECT_COMPILE exit 101 E0599 ×1 1.16.3 os=linux sha256:c2fafad2bab2…error[E0599]: no method named `is_rtl` found for struct `BidiClass` in the current scoperust/rustc · compiler-diagnostic · outer cargo runQualidade da evidência: complete · Variantes de ambiente: 1 · Primeiro registro: 2026-10-19 · Visto por último: 2026-10-19
-
observado PROJECT_COMPILE exit 101 ×1 1.16.3 os=linux sha256:6d7f0ce8254c…error: could not compile `sample-idna-adapter` (bin <str>) due to 1 previous errorrust/rustc · compiler-diagnostic · outer cargo buildQualidade da evidência: complete · Variantes de ambiente: 1 · Primeiro registro: 2026-10-19 · Visto por último: 2026-10-19
-
observado PROJECT_COMPILE exit 101 E0599 ×1 1.16.3 os=linux sha256:b07a18e8da2b…error[E0599]: no associated function or constant named `new` found for struct `Adapter` in the current scoperust/rustc · compiler-diagnostic · outer cargo buildQualidade da evidência: complete · Variantes de ambiente: 1 · Primeiro registro: 2026-10-19 · Visto por último: 2026-10-19
-
observado PROJECT_COMPILE exit 101 ×1 1.16.3 os=linux sha256:aaf1990e27c5…error: could not compile `sample-addr2line` (test <str>) due to 2 previous errors …rust/rustc · compiler-diagnostic · outer cargo testQualidade da evidência: complete · Variantes de ambiente: 1 · Primeiro registro: 2026-10-19 · Visto por último: 2026-10-19
-
observado PROJECT_COMPILE exit 101 E0432 ×1 1.16.3 os=linux sha256:ac7324fdd333…error[E0432]: unresolved import `addr2line::object`rust/rustc · compiler-diagnostic · outer cargo testQualidade da evidência: complete · Variantes de ambiente: 1 · Primeiro registro: 2026-10-19 · Visto por último: 2026-10-19
-
observado PROJECT_COMPILE exit 101 E0599 ×1 1.16.3 os=linux sha256:ff95f88fed26…error[E0599]: no associated function or constant named `new` found for struct `addr2line::Context<R>` in the current scoperust/rustc · compiler-diagnostic · outer cargo testQualidade da evidência: complete · Variantes de ambiente: 1 · Primeiro registro: 2026-10-19 · Visto por último: 2026-10-19
-
observado PROJECT_TEST exit 101 E0432 ×1 1.16.3 os=linux sha256:c4faf3580ad8…34 | let ctx = Context::new(&obj_file).expect(<str>); · | ^^^ associated function or constant not found in `addr2line::Context<_>` · | …rust/test · test-runner-diagnostic · outer cargo testQualidade da evidência: complete · Variantes de ambiente: 1 · Primeiro registro: 2026-10-19 · Visto por último: 2026-10-19
-
observado PROJECT_COMPILE exit 101 E0308 ×1 1.16.3 os=linux sha256:0479254218ac…error[E0308]: mismatched typesrust/rustc · compiler-diagnostic · outer cargo runQualidade da evidência: complete · Variantes de ambiente: 1 · Primeiro registro: 2026-10-19 · Visto por último: 2026-10-19
-
observado PROJECT_COMPILE exit 101 ×1 1.16.3 os=linux sha256:4c786cbbce8a…error: could not compile `sample` (bin <str>) due to 1 previous errorrust/rustc · compiler-diagnostic · outer cargo runQualidade da evidência: complete · Variantes de ambiente: 1 · Primeiro registro: 2026-10-19 · Visto por último: 2026-10-19
Símbolos
Ainda não há símbolos com evidências.