記録cargosimd-adler320.3.10
環境の詳細
プロジェクトレベルの観測とシンボル/コントラクト検証は別々に集計し、決して合算しません。
これらの数値は、シンボルがどう呼び出されたかを区別しません。オーバーロード、引数の形、オプションはまとめて集計されます。特定の呼び出し方がどう動くかは、この数値ではなくサンプルの契約が証明します。
| 環境 | 信頼度 | 観測 | 検証 | 成功率 | ピア | 最終観測 |
|---|---|---|---|---|---|---|
| unknown · Rust · cargo · linux glibc
観測: PROJECT_COMPILE 3✓ 11✕ · PROJECT_PROCESS 16✓ · PROJECT_TEST 5✓ 3✕ — 検証: UNKNOWN 0✓ 1✕
|
ELEVATED FAILURE | 38 | 1 | 62% | 1 | 2026-10-20 |
最近の失敗クラスター
-
観測済み PROJECT_COMPILE exit 101 E0599 ×2 0.3.10 os=linux sha256:40827ed62704…error[E0599]: no method named `is_none` found for tuple `(u64, u64, addr2line::Location<'_>)` in the current scoperust/rustc · compiler-diagnostic · outer cargo run証拠品質: complete · 環境バリアント: 1 · 初回記録: 2026-09-19 · 最終観測: 2026-09-19
-
観測済み PROJECT_TEST exit 101 ×2 0.3.10 os=linux sha256:4f232600c5a8…error: test failed, to rerun pass `--test contract` · running 0 tests …rust/test · test-runner-diagnostic · outer cargo test証拠品質: complete · 環境バリアント: 1 · 初回記録: 2026-10-20 · 最終観測: 2026-10-20
-
観測済み PROJECT_COMPILE exit 101 ×1 0.3.10 os=linux sha256:7e12f411f813…error: could not compile `test_addr2line` (bin <str>) due to 1 previous errorrust/rustc · compiler-diagnostic · outer cargo run証拠品質: complete · 環境バリアント: 1 · 初回記録: 2026-09-19 · 最終観測: 2026-09-19
-
観測済み PROJECT_COMPILE exit 101 ×1 0.3.10 os=linux sha256:9d9b6169d6bd…error: could not compile `test_addr2line` (bin <str>) due to 9 previous errorsrust/rustc · compiler-diagnostic · outer cargo run証拠品質: complete · 環境バリアント: 1 · 初回記録: 2026-09-19 · 最終観測: 2026-09-19
-
観測済み PROJECT_COMPILE exit 101 E0063 ×1 0.3.10 os=linux sha256:b4d73c642e61…error[E0063]: missing fields `debug_macinfo` and `debug_macro` in initializer of `Dwarf<_>`rust/rustc · compiler-diagnostic · outer cargo run証拠品質: complete · 環境バリアント: 1 · 初回記録: 2026-09-19 · 最終観測: 2026-09-19
-
観測済み PROJECT_COMPILE exit 101 E0061 ×1 0.3.10 os=linux sha256:db7a3103c11e…error[E0061]: this function takes 2 arguments but 1 argument was suppliedrust/rustc · compiler-diagnostic · outer cargo run証拠品質: complete · 環境バリアント: 1 · 初回記録: 2026-09-19 · 最終観測: 2026-09-19
-
観測済み UNKNOWN exit 101 証拠の欠落 ×1 0.3.10 os=linux sha256:c970c257481f…Compiling cfg-if v1.0.5 · Compiling simd-adler32 v0.3.10 · Compiling adler2 v2.0.1 · Compiling crc32fast v1.5.2cargo · unclassified-diagnostic · outer cargo run · gap stage-unknown証拠品質: complete · 環境バリアント: 1 · 初回記録: 2026-09-19 · 最終観測: 2026-09-19診断再検証候補
-
観測済み PROJECT_COMPILE exit 101 ×1 0.3.10 os=linux sha256:aaf1990e27c5…error: could not compile `sample-addr2line` (test <str>) due to 2 previous errors …rust/rustc · compiler-diagnostic · outer cargo test証拠品質: complete · 環境バリアント: 1 · 初回記録: 2026-10-19 · 最終観測: 2026-10-19
-
観測済み PROJECT_COMPILE exit 101 E0432 ×1 0.3.10 os=linux sha256:ac7324fdd333…error[E0432]: unresolved import `addr2line::object`rust/rustc · compiler-diagnostic · outer cargo test証拠品質: complete · 環境バリアント: 1 · 初回記録: 2026-10-19 · 最終観測: 2026-10-19
-
観測済み PROJECT_COMPILE exit 101 E0599 ×1 0.3.10 os=linux sha256:ff95f88fed26…error[E0599]: no associated function or constant named `new` found for struct `addr2line::Context<R>` in the current scoperust/rustc · compiler-diagnostic · outer cargo test証拠品質: complete · 環境バリアント: 1 · 初回記録: 2026-10-19 · 最終観測: 2026-10-19
-
観測済み PROJECT_TEST exit 101 E0432 ×1 0.3.10 os=linux sha256:c4faf3580ad8…34 | let ctx = Context::new(&obj_file).expect(<str>); · | ^^^ associated function or constant not found in `addr2line::Context<_>` · | …rust/test · test-runner-diagnostic · outer cargo test証拠品質: complete · 環境バリアント: 1 · 初回記録: 2026-10-19 · 最終観測: 2026-10-19
-
観測済み PROJECT_COMPILE exit 101 E0308 ×1 0.3.10 os=linux sha256:0479254218ac…error[E0308]: mismatched typesrust/rustc · compiler-diagnostic · outer cargo run証拠品質: complete · 環境バリアント: 1 · 初回記録: 2026-10-19 · 最終観測: 2026-10-19
最も多く報告された 12 件を表示しています。この座標に記録された失敗クラスタは 13 件です。残りは単発の報告です。
シンボル
エビデンスのあるシンボルはまだありません。