Recordscargoserde_derive1.0.229Serialize
Published samples
- serde_derive 1.0.229: Serialize This network offers one thing: a sample that builds. It ran the sample in a sandbox and kept the signed receipt. It grades nothing and warrants nothing — whether the same code builds where you are is not something it measured. HOWSerialize MIT-0 · 2026-09-14
Compatibility matrix
Project-level observations and symbol/contract verifications are counted separately and never combined.
These counts do not distinguish how the symbol was called: overloads, argument shapes and options are pooled together. What a particular call shape does is proven by a sample's contract, not by these numbers.
| Environment | Confidence | Observations | Verified | Pass rate | Peers | Last seen |
|---|---|---|---|---|---|---|
| rust 1 · Rust · cargo · linux musl · docker
Observations: PROJECT_TEST 2✓ — Verified: CONTRACT 1✓
|
LOW | 2 | 1 | 100% | 1 · 1✓ | 2026-09-17 |
snapshot · 2026-09-17
Failure clusters
-
observed PROJECT_COMPILE exit 101 E0433 ×1 1.0.229 os=linux sha256:4cea35867957…error[E0433]: cannot find `__private229` in `_serde` · error[E0433]: cannot find `Serializer` in `_serde` · error[E0433]: cannot find `ser` in `_serde`rust/rustc · compiler-diagnostic · outer cargo checkEvidence quality: complete · Environment variants: 1 · First recorded: 2026-09-14 · Last seen: 2026-09-14
-
observed PROJECT_COMPILE exit 101 E0283 ×1 1.0.229 os=linux sha256:55052d6fc8b2…error[E0283]: type annotations neededrust/rustc · compiler-diagnostic · outer cargo runEvidence quality: complete · Environment variants: 1 · First recorded: 2026-09-14 · Last seen: 2026-09-14
-
observed PROJECT_COMPILE exit 101 ×1 1.0.229 os=linux sha256:7461bf46226d…error: could not compile `sample-serde-core` (bin <str>) due to 3 previous errorsrust/rustc · compiler-diagnostic · outer cargo runEvidence quality: complete · Environment variants: 1 · First recorded: 2026-09-14 · Last seen: 2026-09-14
-
observed PROJECT_COMPILE exit 101 E0405 ×1 1.0.229 os=linux sha256:8a1088019b07…error[E0405]: cannot find trait `Serialize` in module `_serde` · error[E0405]: cannot find trait `Serializer` in module `_serde`rust/rustc · compiler-diagnostic · outer cargo checkEvidence quality: complete · Environment variants: 1 · First recorded: 2026-09-14 · Last seen: 2026-09-14
-
observed PROJECT_COMPILE exit 101 ×1 1.0.229 os=linux sha256:b21c095b1aba…error: could not compile `sample-serde-core` (bin <str>) due to 1 previous errorrust/rustc · compiler-diagnostic · outer cargo runEvidence quality: complete · Environment variants: 1 · First recorded: 2026-09-14 · Last seen: 2026-09-14
-
observed PROJECT_COMPILE exit 101 ×1 1.0.229 os=linux sha256:df160d9ca814…error: could not compile `sample-serde-derive` (bin <str>) due to 7 previous errorsrust/rustc · compiler-diagnostic · outer cargo checkEvidence quality: complete · Environment variants: 1 · First recorded: 2026-09-14 · Last seen: 2026-09-14
-
observed PROJECT_COMPILE exit 101 E0599 ×1 1.0.229 os=linux sha256:f713b890152f…error[E0599]: no method named `into_deserializer` found for enum `std::option::Option<T>` in the current scope …rust/rustc · compiler-diagnostic · outer cargo runEvidence quality: complete · Environment variants: 1 · First recorded: 2026-09-14 · Last seen: 2026-09-14
-
observed UNKNOWN exit 101 Evidence gap ×1 1.0.229 os=linux sha256:eeb9864183a6…Compiling sample-serde-core v1.0.0 (<path> · Finished `dev` profile [unoptimized + debuginfo] target(s) in 0.27s · Running `target/debug/contract` …cargo · unclassified-diagnostic · outer cargo run · gap stage-unknownEvidence quality: complete · Environment variants: 1 · First recorded: 2026-09-14 · Last seen: 2026-09-14Diagnostic re-verification candidate