記録cargoserde_core1.0.229
どのシンボルがどこで動いたか
このバージョンのシンボル × OS です。セルをクリックすると、パッケージの互換性キューブに掘り下げられます。
12026-09-14
セルの読み方: 数字は割合が依拠する記録済み観測の数です — 1 回のビルドは到達した段階ごとに観測を 1 件残すため、ビルド数でもマシン数でも人数でもありません。隣の文書は出所の異なる別の事実です。その座標にサンプルがあるか、そして私たちがそこで実行した結果がどうだったかです。
- この座標にはまだサンプルがない
- サンプルあり — この座標ではまだ実行していない
- サンプルあり — この座標で実行し、問題なく終わった
- サンプルあり — この座標で実行し、失敗した
- サンプルあり — この座標には成功した実行と失敗した実行の両方が記録されている
- 記録なし — 不明であって「動く」でも「壊れている」でもない
- このセルの下にまだ段階がある — クリックで開く
文書があれば、その座標にサンプルがあるということです。サンプルが存在するかどうかはこのリリースとこの API についての事実で、OS・ランタイム・パッケージマネージャが変わっても変わりません。色は、今見ている環境でそのサンプルがどう実行されたかを示します。
環境の詳細
プロジェクトレベルの観測とシンボル/コントラクト検証は別々に集計し、決して合算しません。
これらの数値は、シンボルがどう呼び出されたかを区別しません。オーバーロード、引数の形、オプションはまとめて集計されます。特定の呼び出し方がどう動くかは、この数値ではなくサンプルの契約が証明します。
| 環境 | 信頼度 | 観測 | 検証 | 成功率 | ピア | 最終観測 |
|---|---|---|---|---|---|---|
| unknown · Rust · cargo · linux glibc
観測: PROJECT_COMPILE 6✓ 4✕ · PROJECT_PROCESS 5✓ · PROJECT_TEST 1✓ — 使用: USED 2✓ — 検証: UNKNOWN 0✓ 1✕
|
ELEVATED FAILURE | 16 +2 | 1 | 71% | 1 | 2026-09-14 |
| rust 1 · Rust · cargo · linux musl · docker
観測: PROJECT_LOAD 2✓ · PROJECT_TEST 2✓ — 使用: USED 3✓ — 検証: CONTRACT 1✓
|
LOW | 4 +3 | 1 | 100% | 1 · 1✓ | 2026-09-17 |
最近の失敗クラスター
-
観測済み PROJECT_COMPILE exit 101 E0283 ×1 1.0.229 os=linux serde_core sha256:55052d6fc8b2…error[E0283]: type annotations neededrust/rustc · compiler-diagnostic · outer cargo run証拠品質: complete · 環境バリアント: 1 · 初回記録: 2026-09-14 · 最終観測: 2026-09-14
-
観測済み PROJECT_COMPILE exit 101 ×1 1.0.229 os=linux serde_core sha256:7461bf46226d…error: could not compile `sample-serde-core` (bin <str>) due to 3 previous errorsrust/rustc · compiler-diagnostic · outer cargo run証拠品質: complete · 環境バリアント: 1 · 初回記録: 2026-09-14 · 最終観測: 2026-09-14
-
観測済み PROJECT_COMPILE exit 101 ×1 1.0.229 os=linux serde_core sha256:b21c095b1aba…error: could not compile `sample-serde-core` (bin <str>) due to 1 previous errorrust/rustc · compiler-diagnostic · outer cargo run証拠品質: complete · 環境バリアント: 1 · 初回記録: 2026-09-14 · 最終観測: 2026-09-14
-
観測済み PROJECT_COMPILE exit 101 E0599 ×1 1.0.229 os=linux serde_core sha256:f713b890152f…error[E0599]: no method named `into_deserializer` found for enum `std::option::Option<T>` in the current scope …rust/rustc · compiler-diagnostic · outer cargo run証拠品質: complete · 環境バリアント: 1 · 初回記録: 2026-09-14 · 最終観測: 2026-09-14
-
観測済み UNKNOWN exit 101 証拠の欠落 ×1 1.0.229 os=linux serde_core sha256:eeb9864183a6…Compiling sample-serde-core v1.0.0 (<path> · Finished `dev` profile [unoptimized + debuginfo] target(s) in 0.27s · Running `target/debug/contract` …cargo · unclassified-diagnostic · outer cargo run · gap stage-unknown証拠品質: complete · 環境バリアント: 1 · 初回記録: 2026-09-14 · 最終観測: 2026-09-14診断再検証候補
シンボル
- serde_core 0/1 回通過
公開したサンプル
- serde_core 1.0.229 このネットワークが提供するのは一つだけです。ビルドされるサンプル。サンドボックスで実行し、署名済みの受領証を保管します。等級はつけず、何も保証しません — 同じコードがあなたの環境でビルドされるかは測定していません。 HOW MIT-0 · 2026-09-14