Registroscargoserde1.0.229chrono::DateTime
reclamado por 3 paquetes — esta evidencia no puede decir de quién es la API
Ejemplos publicados
- serde 1.0.229: Disabling chrono default features strips Utc::now and Local which require the clock feature rather than std, while serde support requires an explicit opt-in serde feature and serializes DateTime as an RFC 3339 string Esta red ofrece una sola cosa: una muestra que compila. La ejecutó en un sandbox y guardó el recibo firmado. No califica ni garantiza nada: si el mismo código compila donde estás no es algo que haya medido. HOWchrono::DateTimechrono::Utcchrono::NaiveDatechrono::NaiveTimechrono::NaiveDateTimechrono::Durationrust MIT-0 · 2026-08-15
Matriz de compatibilidad
Las observaciones a nivel de proyecto y las verificaciones de símbolo/contrato se cuentan por separado y nunca se combinan.
Estos recuentos no distinguen cómo se llamó al símbolo: las sobrecargas, las formas de los argumentos y las opciones se agrupan. Lo que hace una forma de llamada concreta lo demuestra el contrato de una muestra, no estas cifras.
| Entorno | Confianza | Observaciones | Verificado | Tasa de éxito | Pares | Última observación |
|---|---|---|---|---|---|---|
| rust 1 · Rust · cargo · linux musl · docker
Verificado: CONTRACT 1✓ 1✕
|
ELEVATED FAILURE | 0 | 2 | 50% | 0 · 2✓ | 2026-09-08 |
snapshot · 2026-09-15
Clústeres de fallos
-
observado PROJECT_COMPILE exit 101 ×5 1.0.229 os=linux sha256:113664d7d918…error: could not compile `probe_icu` (bin <str>) due to 1 previous errorrust/rustc · compiler-diagnostic · outer cargo runCalidad de evidencia: complete · Variantes de entorno: 1 · Primer registro: 2026-09-20 · Última observación: 2026-09-20
-
observado PROJECT_TEST Brecha de evidencia ×1 1.0.229 executionContext=rust · os=linux · runtime=rust@1Calidad de evidencia: legacy-evidence-incomplete · Variantes de entorno: 1 · Primer registro: 2026-09-08 · Última observación: 2026-09-08
-
observado PROJECT_COMPILE exit 101 E0599 ×1 1.0.229 os=linux sha256:0fbd73add053…error[E0599]: no method named `is_empty` found for struct `Char16Trie<'data>` in the current scoperust/rustc · compiler-diagnostic · outer cargo runCalidad de evidencia: complete · Variantes de entorno: 1 · Primer registro: 2026-09-20 · Última observación: 2026-09-20
-
observado PROJECT_COMPILE exit 101 E0599 ×1 1.0.229 os=linux sha256:16d23d1801b1…error[E0599]: no method named `normalize` found for struct `ComposingNormalizer` in the current scoperust/rustc · compiler-diagnostic · outer cargo runCalidad de evidencia: complete · Variantes de entorno: 1 · Primer registro: 2026-09-20 · Última observación: 2026-09-20
-
observado PROJECT_COMPILE exit 101 E0277 ×1 1.0.229 os=linux sha256:208766dc43dd…error[E0277]: the trait bound `DirectULE: AsULE` is not satisfied · error[E0277]: the size for values of type `[_]` cannot be known at compilation timerust/rustc · compiler-diagnostic · outer cargo runCalidad de evidencia: complete · Variantes de entorno: 1 · Primer registro: 2026-09-21 · Última observación: 2026-09-21
-
observado PROJECT_COMPILE exit 101 E0716 ×1 1.0.229 os=linux sha256:24047988143e…error[E0716]: temporary value dropped while borrowedrust/rustc · compiler-diagnostic · outer cargo runCalidad de evidencia: complete · Variantes de entorno: 1 · Primer registro: 2026-09-21 · Última observación: 2026-09-21
-
observado PROJECT_COMPILE exit 101 E0599 ×1 1.0.229 os=linux sha256:267702ebcc26…error[E0599]: no associated function or constant named `new_nfc_unstable` found for struct `ComposingNormalizer` in the current scoperust/rustc · compiler-diagnostic · outer cargo runCalidad de evidencia: complete · Variantes de entorno: 1 · Primer registro: 2026-09-20 · Última observación: 2026-09-20
-
observado PROJECT_COMPILE exit 101 E0599 ×1 1.0.229 os=linux sha256:2c8ce33ea821…error[E0599]: no method named `to_aligned` found for reference `&RawBytesULE<4>` in the current scoperust/rustc · compiler-diagnostic · outer cargo runCalidad de evidencia: complete · Variantes de entorno: 1 · Primer registro: 2026-09-21 · Última observación: 2026-09-21
-
observado PROJECT_COMPILE exit 101 ×1 1.0.229 os=linux sha256:4518371e6dd8…error: could not compile `test-zerovec` (bin <str>) due to 1 previous errorrust/rustc · compiler-diagnostic · outer cargo runCalidad de evidencia: complete · Variantes de entorno: 1 · Primer registro: 2026-09-21 · Última observación: 2026-09-21
-
observado PROJECT_COMPILE exit 101 E0609 ×1 1.0.229 os=linux sha256:463107715912…error[E0609]: no field `SINGLETON_NORMALIZER_NFC_V1` on type `MyProvider`rust/rustc · compiler-diagnostic · outer cargo runCalidad de evidencia: complete · Variantes de entorno: 1 · Primer registro: 2026-09-20 · Última observación: 2026-09-20
-
observado PROJECT_COMPILE exit 101 ×1 1.0.229 os=linux sha256:4880cde154a0…error: could not compile `probe_zerovec` (bin <str>) due to 3 previous errors; 1 warning emittedrust/rustc · compiler-diagnostic · outer cargo runCalidad de evidencia: complete · Variantes de entorno: 1 · Primer registro: 2026-09-21 · Última observación: 2026-09-21
-
observado PROJECT_COMPILE exit 101 E0277 ×1 1.0.229 os=linux sha256:86285648d445…error[E0277]: the trait bound `Person<'_>: VarULE` is not satisfiedrust/rustc · compiler-diagnostic · outer cargo runCalidad de evidencia: complete · Variantes de entorno: 1 · Primer registro: 2026-09-21 · Última observación: 2026-09-21
Se muestran los 12 más reportados de 21 grupos de fallos registrados. El resto son reportes únicos.