記録cargoserde1.0.229axum::body::Body
6 個のパッケージが同じ主張 — この証拠ではどのパッケージの API か判別できません
公開したサンプル
- serde 1.0.229: Test axum handlers and routing without binding a port by driving the whole Router through tower's ServiceExt::oneshot, and get the exact status for each way a request can be wrong このネットワークが提供するのは一つだけです。ビルドされるサンプル。サンドボックスで実行し、署名済みの受領証を保管します。等級はつけず、何も保証しません — 同じコードがあなたの環境でビルドされるかは測定していません。 HOWtower::ServiceExt::oneshotaxum::Router::routeaxum::Router::with_stateaxum::extract::Pathaxum::extract::Queryaxum::extract::Stateaxum::Jsonaxum::body::Bodyhttp_body_util::BodyExt::collectaxum::debug_handlerrust 1 MIT-0 · 2026-08-14
互換性マトリクス
プロジェクトレベルの観測とシンボル/コントラクト検証は別々に集計し、決して合算しません。
これらの数値は、シンボルがどう呼び出されたかを区別しません。オーバーロード、引数の形、オプションはまとめて集計されます。特定の呼び出し方がどう動くかは、この数値ではなくサンプルの契約が証明します。
| 環境 | 信頼度 | 観測 | 検証 | 成功率 | ピア | 最終観測 |
|---|---|---|---|---|---|---|
| rust 1 · Rust · cargo · linux musl · docker
検証: CONTRACT 2✓ 1✕
|
ELEVATED FAILURE | 0 | 3 | 67% | 0 · 2✓ | 2026-09-15 |
snapshot · 2026-09-16
失敗クラスター
-
観測済み PROJECT_COMPILE exit 101 ×5 1.0.229 os=linux sha256:113664d7d918…error: could not compile `probe_icu` (bin <str>) due to 1 previous errorrust/rustc · compiler-diagnostic · outer cargo run証拠品質: complete · 環境バリアント: 1 · 初回記録: 2026-09-20 · 最終観測: 2026-09-20
-
観測済み PROJECT_TEST 証拠の欠落 ×1 1.0.229 executionContext=rust · os=linux · runtime=rust@1証拠品質: legacy-evidence-incomplete · 環境バリアント: 1 · 初回記録: 2026-09-08 · 最終観測: 2026-09-08
-
観測済み PROJECT_COMPILE exit 101 E0599 ×1 1.0.229 os=linux sha256:0fbd73add053…error[E0599]: no method named `is_empty` found for struct `Char16Trie<'data>` in the current scoperust/rustc · compiler-diagnostic · outer cargo run証拠品質: complete · 環境バリアント: 1 · 初回記録: 2026-09-20 · 最終観測: 2026-09-20
-
観測済み PROJECT_COMPILE exit 101 E0599 ×1 1.0.229 os=linux sha256:16d23d1801b1…error[E0599]: no method named `normalize` found for struct `ComposingNormalizer` in the current scoperust/rustc · compiler-diagnostic · outer cargo run証拠品質: complete · 環境バリアント: 1 · 初回記録: 2026-09-20 · 最終観測: 2026-09-20
-
観測済み PROJECT_COMPILE exit 101 E0277 ×1 1.0.229 os=linux sha256:208766dc43dd…error[E0277]: the trait bound `DirectULE: AsULE` is not satisfied · error[E0277]: the size for values of type `[_]` cannot be known at compilation timerust/rustc · compiler-diagnostic · outer cargo run証拠品質: complete · 環境バリアント: 1 · 初回記録: 2026-09-21 · 最終観測: 2026-09-21
-
観測済み PROJECT_COMPILE exit 101 E0716 ×1 1.0.229 os=linux sha256:24047988143e…error[E0716]: temporary value dropped while borrowedrust/rustc · compiler-diagnostic · outer cargo run証拠品質: complete · 環境バリアント: 1 · 初回記録: 2026-09-21 · 最終観測: 2026-09-21
-
観測済み PROJECT_COMPILE exit 101 E0599 ×1 1.0.229 os=linux sha256:267702ebcc26…error[E0599]: no associated function or constant named `new_nfc_unstable` found for struct `ComposingNormalizer` in the current scoperust/rustc · compiler-diagnostic · outer cargo run証拠品質: complete · 環境バリアント: 1 · 初回記録: 2026-09-20 · 最終観測: 2026-09-20
-
観測済み PROJECT_COMPILE exit 101 E0599 ×1 1.0.229 os=linux sha256:2c8ce33ea821…error[E0599]: no method named `to_aligned` found for reference `&RawBytesULE<4>` in the current scoperust/rustc · compiler-diagnostic · outer cargo run証拠品質: complete · 環境バリアント: 1 · 初回記録: 2026-09-21 · 最終観測: 2026-09-21
-
観測済み PROJECT_COMPILE exit 101 ×1 1.0.229 os=linux sha256:4518371e6dd8…error: could not compile `test-zerovec` (bin <str>) due to 1 previous errorrust/rustc · compiler-diagnostic · outer cargo run証拠品質: complete · 環境バリアント: 1 · 初回記録: 2026-09-21 · 最終観測: 2026-09-21
-
観測済み PROJECT_COMPILE exit 101 E0609 ×1 1.0.229 os=linux sha256:463107715912…error[E0609]: no field `SINGLETON_NORMALIZER_NFC_V1` on type `MyProvider`rust/rustc · compiler-diagnostic · outer cargo run証拠品質: complete · 環境バリアント: 1 · 初回記録: 2026-09-20 · 最終観測: 2026-09-20
-
観測済み PROJECT_COMPILE exit 101 ×1 1.0.229 os=linux sha256:4880cde154a0…error: could not compile `probe_zerovec` (bin <str>) due to 3 previous errors; 1 warning emittedrust/rustc · compiler-diagnostic · outer cargo run証拠品質: complete · 環境バリアント: 1 · 初回記録: 2026-09-21 · 最終観測: 2026-09-21
-
観測済み PROJECT_COMPILE exit 101 E0277 ×1 1.0.229 os=linux sha256:86285648d445…error[E0277]: the trait bound `Person<'_>: VarULE` is not satisfiedrust/rustc · compiler-diagnostic · outer cargo run証拠品質: complete · 環境バリアント: 1 · 初回記録: 2026-09-21 · 最終観測: 2026-09-21
最も多く報告された 12 件を表示しています。この座標に記録された失敗クラスタは 21 件です。残りは単発の報告です。