Aufzeichnungencargorustversion1.0.23
Umgebungsdetails
Beobachtungen auf Projektebene und Symbol-/Contract-Verifizierungen werden getrennt gezählt und niemals zusammengerechnet.
Diese Zahlen unterscheiden nicht, wie das Symbol aufgerufen wurde: Überladungen, Argumentformen und Optionen werden zusammengefasst. Was eine bestimmte Aufrufform tut, beweist der Vertrag eines Samples – nicht diese Zahlen.
| Umgebung | Konfidenz | Beobachtungen | Verifiziert | Erfolgsquote | Peers | Zuletzt gesehen |
|---|---|---|---|---|---|---|
| unknown · Rust · cargo · linux glibc
Beobachtungen: PROJECT_COMPILE 2✓ 4✕ · PROJECT_PROCESS 32✓ — Verifiziert: UNKNOWN 0✓ 8✕
|
ELEVATED FAILURE | 38 | 8 | 74 % | 1 | 2026-10-17 |
Aktuelle Fehler-Cluster
-
beobachtet PROJECT_COMPILE exit 101 ×1 1.0.23 os=linux sha256:4d444e9e07b5…error: could not compile `test-wb` (bin <str>) due to 1 previous errorrust/rustc · compiler-diagnostic · outer cargo checkBeweisqualität: complete · Umgebungsvarianten: 1 · Zuerst erfasst: 2026-09-19 · Zuletzt gesehen: 2026-09-19
-
beobachtet PROJECT_COMPILE exit 101 E0432 ×1 1.0.23 os=linux sha256:81ff5a6ae827…error[E0432]: unresolved import `wasm_bindgen_macro`rust/rustc · compiler-diagnostic · outer cargo checkBeweisqualität: complete · Umgebungsvarianten: 1 · Zuerst erfasst: 2026-09-19 · Zuletzt gesehen: 2026-09-19
-
beobachtet PROJECT_COMPILE exit 101 E0433 ×1 1.0.23 os=linux sha256:8d7d824b0493…error[E0433]: cannot find module or crate `wasm_bindgen` in this scoperust/rustc · compiler-diagnostic · outer cargo checkBeweisqualität: complete · Umgebungsvarianten: 1 · Zuerst erfasst: 2026-09-19 · Zuletzt gesehen: 2026-09-19
-
beobachtet PROJECT_COMPILE exit 101 ×1 1.0.23 os=linux sha256:d0b315730521…error: could not compile `test-macro` (bin <str>) due to 1 previous errorrust/rustc · compiler-diagnostic · outer cargo checkBeweisqualität: complete · Umgebungsvarianten: 1 · Zuerst erfasst: 2026-09-19 · Zuletzt gesehen: 2026-09-19
-
beobachtet UNKNOWN signal ABORTED Beweislücke ×1 1.0.23 os=linux sha256:5650faa5dc98…Finished `dev` profile [unoptimized + debuginfo] target(s) in 0.02s · Running `target/debug/test-js-sys` …cargo · unclassified-diagnostic · outer cargo run · gap stage-unknownBeweisqualität: complete · Umgebungsvarianten: 1 · Zuerst erfasst: 2026-09-19 · Zuletzt gesehen: 2026-09-19Kandidat für diagnostische Neuprüfung
-
beobachtet UNKNOWN exit 101 Beweislücke ×1 1.0.23 os=linux sha256:7714306cce9e…Compiling unicode-ident v1.0.26 · Compiling cfg-if v1.0.5 · Compiling once_cell v1.21.4 · Compiling proc-macro2 v1.0.107cargo · unclassified-diagnostic · outer cargo run · gap stage-unknownBeweisqualität: complete · Umgebungsvarianten: 1 · Zuerst erfasst: 2026-09-19 · Zuletzt gesehen: 2026-09-19Kandidat für diagnostische Neuprüfung
-
beobachtet UNKNOWN exit 101 Beweislücke ×1 1.0.23 os=linux sha256:c6c5fb2b7e90…Compiling test_wb v0.1.0 (<path> · Finished `dev` profile [unoptimized + debuginfo] target(s) in 0.18s · Running `target/debug/test_wb` …cargo · unclassified-diagnostic · outer cargo run · gap stage-unknownBeweisqualität: complete · Umgebungsvarianten: 1 · Zuerst erfasst: 2026-09-19 · Zuletzt gesehen: 2026-09-19Kandidat für diagnostische Neuprüfung
-
beobachtet UNKNOWN signal ABORTED Beweislücke ×1 1.0.23 os=linux sha256:034c59ed23d6…Compiling sample-wasm-bindgen v0.1.0 (<path> · Finished `dev` profile [unoptimized + debuginfo] target(s) in 0.19s …cargo · unclassified-diagnostic · outer cargo run · gap stage-unknownBeweisqualität: complete · Umgebungsvarianten: 1 · Zuerst erfasst: 2026-10-17 · Zuletzt gesehen: 2026-10-17Kandidat für diagnostische Neuprüfung
-
beobachtet UNKNOWN exit 101 Beweislücke ×1 1.0.23 os=linux sha256:49fbc1f03025…Compiling sample-wasm-bindgen v0.1.0 (<path> · Finished `dev` profile [unoptimized + debuginfo] target(s) in 0.33s …cargo · unclassified-diagnostic · outer cargo run · gap stage-unknownBeweisqualität: complete · Umgebungsvarianten: 1 · Zuerst erfasst: 2026-10-17 · Zuletzt gesehen: 2026-10-17Kandidat für diagnostische Neuprüfung
-
beobachtet UNKNOWN exit 101 Beweislücke ×1 1.0.23 os=linux sha256:ce88fa682bac…Updating crates.io index · Locking 12 packages to latest compatible versions · Adding wasm-bindgen v0.2.128 (available: v0.2.129) …cargo · unclassified-diagnostic · outer cargo run · gap stage-unknownBeweisqualität: complete · Umgebungsvarianten: 1 · Zuerst erfasst: 2026-10-17 · Zuletzt gesehen: 2026-10-17Kandidat für diagnostische Neuprüfung
-
beobachtet UNKNOWN exit 101 Beweislücke ×1 1.0.23 os=linux sha256:d5ef89c0ce65…Compiling sample-wasm-bindgen v0.1.0 (<path> · Finished `dev` profile [unoptimized + debuginfo] target(s) in 0.25s …cargo · unclassified-diagnostic · outer cargo run · gap stage-unknownBeweisqualität: complete · Umgebungsvarianten: 1 · Zuerst erfasst: 2026-10-17 · Zuletzt gesehen: 2026-10-17Kandidat für diagnostische Neuprüfung
-
beobachtet UNKNOWN exit 101 Beweislücke ×1 1.0.23 os=linux sha256:e0ded99321af…Compiling sample-wasm-bindgen v0.1.0 (<path> · Finished `dev` profile [unoptimized + debuginfo] target(s) in 0.46s …cargo · unclassified-diagnostic · outer cargo run · gap stage-unknownBeweisqualität: complete · Umgebungsvarianten: 1 · Zuerst erfasst: 2026-10-17 · Zuletzt gesehen: 2026-10-17Kandidat für diagnostische Neuprüfung
Symbole
Noch keine Symbole mit Evidenz.