记录cargoquote1.0.47
哪个符号在哪里跑过
此版本的符号 × 操作系统。单元格可钻入该包的兼容性立方体。
4○ 42026-09-17
| alpine musl | ubuntu glibc | |
|---|---|---|
| quote | 100%2 | |
| quote::ToTokens | 100%2 | 50%10 |
| quote::TokenStreamExt | 100%1 | |
| quote::format_ident | 100%2 | 50%10 |
| quote::quote | 100%2 | 55%11 |
如何阅读单元格: 数字是该比率所依据的已记录观测次数——一次构建每到达一个阶段就留下一条观测,因此它既不是构建数,也不是机器数或人数。旁边的文档是另一个来源不同的事实:该坐标是否有样例,以及我们在那里运行它的结果。
- 该坐标还没有样例
- 有样例 — 我们尚未在该坐标运行过它
- 有样例 — 我们在该坐标运行过,并且干净地结束
- 有样例 — 我们在该坐标运行过,并且失败了
- 有样例 — 该坐标同时记录了通过的和失败的运行
- 没有记录 — 未知,既非“可用”也非“损坏”
- 这一格下面还有层级 — 点击打开
有文档,就说明该坐标有样例。样例是否存在,是关于这个版本和这个 API 的事实,不随操作系统、运行时或包管理器改变;颜色说的是它在你正在看的那个环境里跑得怎么样。
环境详情
项目级观测与符号/契约验证分别统计,绝不合并。
这些计数不区分符号的调用方式:重载、参数形态和选项被合并统计。某一具体调用方式的行为由样本的契约证明,而不是由这些数字证明。
| 环境 | 置信度 | 观测 | 验证 | 通过率 | 节点 | 最近观测 |
|---|---|---|---|---|---|---|
| unknown · Rust · cargo · linux glibc
观测: PROJECT_COMPILE 7✓ 16✕ · PROJECT_PROCESS 22✓ · PROJECT_TEST 7✓ 1✕ — 使用: USED 2✓ — 验证: UNKNOWN 0✓ 2✕
|
ELEVATED FAILURE | 53 +2 | 2 | 65% | 3 | 2026-09-17 |
| rust 1 · Rust · cargo · linux musl · docker
观测: PROJECT_LOAD 3✓ · PROJECT_TEST 3✓ — 使用: USED 8✓ — 验证: CONTRACT 5✓
|
MEDIUM | 6 +8 | 5 | 100% | 2 · 1✓ | 2026-09-17 |
近期失败聚类
-
已观测 PROJECT_COMPILE exit 101 ×1 1.0.47 os=linux quote::ToTokens sha256:0d5a8e2ccc86…error: could not compile `quote-test` (bin <str>) due to 1 previous error; 1 warning emittedrust/rustc · compiler-diagnostic · outer cargo run证据质量: complete · 环境变体: 1 · 首次记录: 2026-09-14 · 最近观测: 2026-09-14
-
已观测 PROJECT_COMPILE exit 101 E0432 ×1 1.0.47 os=linux quote::ToTokens sha256:4a6dd64b7a9b…error[E0432]: unresolved import `proc_macro2`rust/rustc · compiler-diagnostic · outer cargo test证据质量: complete · 环境变体: 1 · 首次记录: 2026-09-14 · 最近观测: 2026-09-14
-
已观测 PROJECT_COMPILE exit 101 E0277 ×1 1.0.47 os=linux quote::ToTokens sha256:ab12e03ad4b1…error[E0277]: the trait bound `i32: IdentFragment` is not satisfiedrust/rustc · compiler-diagnostic · outer cargo run证据质量: complete · 环境变体: 1 · 首次记录: 2026-09-14 · 最近观测: 2026-09-14
-
已观测 PROJECT_COMPILE exit 101 ×1 1.0.47 os=linux quote::ToTokens sha256:b53ce471a520…error: could not compile `test-quote` (lib) due to 1 previous error; 1 warning emittedrust/rustc · compiler-diagnostic · outer cargo test证据质量: complete · 环境变体: 1 · 首次记录: 2026-09-14 · 最近观测: 2026-09-14
-
已观测 PROJECT_TEST exit 101 ×1 1.0.47 os=linux quote::ToTokens sha256:cc325a11570b…error: test failed, to rerun pass `--lib` · running 6 tests · test tests::test_quote_basic_tokens ... ok …rust/test · test-runner-diagnostic · outer cargo test证据质量: complete · 环境变体: 1 · 首次记录: 2026-09-14 · 最近观测: 2026-09-14
-
已观测 PROJECT_COMPILE exit 101 E0433 ×1 1.0.47 os=linux sha256:4cea35867957…error[E0433]: cannot find `__private229` in `_serde` · error[E0433]: cannot find `Serializer` in `_serde` · error[E0433]: cannot find `ser` in `_serde`rust/rustc · compiler-diagnostic · outer cargo check证据质量: complete · 环境变体: 1 · 首次记录: 2026-09-14 · 最近观测: 2026-09-14
-
已观测 PROJECT_COMPILE exit 101 E0283 ×1 1.0.47 os=linux sha256:55052d6fc8b2…error[E0283]: type annotations neededrust/rustc · compiler-diagnostic · outer cargo run证据质量: complete · 环境变体: 1 · 首次记录: 2026-09-14 · 最近观测: 2026-09-14
-
已观测 PROJECT_COMPILE exit 101 ×1 1.0.47 os=linux sha256:7461bf46226d…error: could not compile `sample-serde-core` (bin <str>) due to 3 previous errorsrust/rustc · compiler-diagnostic · outer cargo run证据质量: complete · 环境变体: 1 · 首次记录: 2026-09-14 · 最近观测: 2026-09-14
-
已观测 PROJECT_COMPILE exit 101 E0405 ×1 1.0.47 os=linux sha256:8a1088019b07…error[E0405]: cannot find trait `Serialize` in module `_serde` · error[E0405]: cannot find trait `Serializer` in module `_serde`rust/rustc · compiler-diagnostic · outer cargo check证据质量: complete · 环境变体: 1 · 首次记录: 2026-09-14 · 最近观测: 2026-09-14
-
已观测 PROJECT_COMPILE exit 101 ×1 1.0.47 os=linux sha256:b21c095b1aba…error: could not compile `sample-serde-core` (bin <str>) due to 1 previous errorrust/rustc · compiler-diagnostic · outer cargo run证据质量: complete · 环境变体: 1 · 首次记录: 2026-09-14 · 最近观测: 2026-09-14
-
已观测 PROJECT_COMPILE exit 101 ×1 1.0.47 os=linux sha256:df160d9ca814…error: could not compile `sample-serde-derive` (bin <str>) due to 7 previous errorsrust/rustc · compiler-diagnostic · outer cargo check证据质量: complete · 环境变体: 1 · 首次记录: 2026-09-14 · 最近观测: 2026-09-14
-
已观测 PROJECT_COMPILE exit 101 E0599 ×1 1.0.47 os=linux sha256:f713b890152f…error[E0599]: no method named `into_deserializer` found for enum `std::option::Option<T>` in the current scope …rust/rustc · compiler-diagnostic · outer cargo run证据质量: complete · 环境变体: 1 · 首次记录: 2026-09-14 · 最近观测: 2026-09-14
显示报告最多的 12 个。此坐标记录的失败聚类共 18 个。其余为单次报告。
符号
- quote 1 1/1 次通过
- quote::ToTokens 1 1/1 次通过
- quote::TokenStreamExt
- quote::format_ident 1 1/1 次通过
- quote::quote 1 1/1 次通过
已发布的示例
- quote 1.0.47 本网络只提供一件事:能构建的样本。它在沙箱中运行并保留签名回执。它不评级、不担保——同样的代码能否在你的环境构建,它没有测量过。 HOW MIT-0 · 2026-09-14