Aufzeichnungencargopin-project-lite0.2.17tower::steer::Steer
von 6 Paketen beansprucht — dieser Beleg kann nicht sagen, wessen API es ist
Veröffentlichte Beispiele
- pin-project-lite 0.2.17: Handle Tower 0.5 middleware composition ordering, poll_ready reservation and clone invalidation traps, buffer-timeout-loadshed queue interactions, Steer head-of-line blocking, and in-place retry policy mutation Dieses Netzwerk bietet eine Sache: ein Sample, das baut. Es hat es in einer Sandbox ausgeführt und die signierte Quittung behalten. Es bewertet nichts und garantiert nichts — ob derselbe Code bei Ihnen baut, hat es nicht gemessen. HOWtower::builder::ServiceBuildertower::Servicetower::ServiceExttower::load_shed::LoadShedtower::limit::ConcurrencyLimittower::buffer::Buffertower::timeout::Timeouttower::steer::Steertower::retry::Policyrust MIT-0 · 2026-08-16
Kompatibilitätsmatrix
Beobachtungen auf Projektebene und Symbol-/Contract-Verifizierungen werden getrennt gezählt und niemals zusammengerechnet.
Diese Zahlen unterscheiden nicht, wie das Symbol aufgerufen wurde: Überladungen, Argumentformen und Optionen werden zusammengefasst. Was eine bestimmte Aufrufform tut, beweist der Vertrag eines Samples – nicht diese Zahlen.
| Umgebung | Konfidenz | Beobachtungen | Verifiziert | Erfolgsquote | Peers | Zuletzt gesehen |
|---|---|---|---|---|---|---|
| rust 1 · Rust · cargo · linux musl · docker
Verifiziert: CONTRACT 1✓ 1✕
|
ELEVATED FAILURE | 0 | 2 | 50 % | 0 · 2✓ | 2026-09-08 |
snapshot · 2026-09-15
Fehler-Cluster
-
beobachtet PROJECT_COMPILE exit 101 ×2 0.2.17 os=linux sha256:a67fd218023f…error: could not compile `test-hyper-util` (bin <str>) due to 1 previous errorrust/rustc · compiler-diagnostic · outer cargo runBeweisqualität: complete · Umgebungsvarianten: 1 · Zuerst erfasst: 2026-09-19 · Zuletzt gesehen: 2026-09-19
-
beobachtet PROJECT_TEST Beweislücke ×1 0.2.17 executionContext=rust · os=linux · runtime=rust@1Beweisqualität: legacy-evidence-incomplete · Umgebungsvarianten: 1 · Zuerst erfasst: 2026-09-08 · Zuletzt gesehen: 2026-09-08
-
beobachtet PROJECT_COMPILE exit 101 ×1 0.2.17 os=linux sha256:1043b6df5638…error: could not compile `test-hyper-util` (bin <str>) due to 1 previous error; 1 warning emittedrust/rustc · compiler-diagnostic · outer cargo checkBeweisqualität: complete · Umgebungsvarianten: 1 · Zuerst erfasst: 2026-09-19 · Zuletzt gesehen: 2026-09-19
-
beobachtet PROJECT_COMPILE exit 101 E0603 ×1 0.2.17 os=linux sha256:5200eda42d99…error[E0603]: module `error` is privaterust/rustc · compiler-diagnostic · outer cargo runBeweisqualität: complete · Umgebungsvarianten: 1 · Zuerst erfasst: 2026-09-19 · Zuletzt gesehen: 2026-09-19
-
beobachtet PROJECT_COMPILE exit 101 E0624 ×1 0.2.17 os=linux sha256:65fda95c6b71…error[E0624]: method `remaining` is privaterust/rustc · compiler-diagnostic · outer cargo runBeweisqualität: complete · Umgebungsvarianten: 1 · Zuerst erfasst: 2026-09-19 · Zuletzt gesehen: 2026-09-19
-
beobachtet PROJECT_COMPILE exit 101 E0599 ×1 0.2.17 os=linux sha256:689d8da7053d…error[E0599]: no method named `http1_only` found for mutable reference `&mut hyper_util::client::legacy::Builder` in the current scoperust/rustc · compiler-diagnostic · outer cargo runBeweisqualität: complete · Umgebungsvarianten: 1 · Zuerst erfasst: 2026-09-19 · Zuletzt gesehen: 2026-09-19
-
beobachtet PROJECT_COMPILE exit 101 E0433 ×1 0.2.17 os=linux sha256:addfa6ed2041…error[E0433]: cannot find module or crate `http` in this scoperust/rustc · compiler-diagnostic · outer cargo runBeweisqualität: complete · Umgebungsvarianten: 1 · Zuerst erfasst: 2026-09-19 · Zuletzt gesehen: 2026-09-19
-
beobachtet PROJECT_COMPILE exit 101 ×1 0.2.17 os=linux sha256:b35018818384…error: could not compile `axum-core-check` (bin <str>) due to 3 previous errorsrust/rustc · compiler-diagnostic · outer cargo runBeweisqualität: complete · Umgebungsvarianten: 1 · Zuerst erfasst: 2026-09-19 · Zuletzt gesehen: 2026-09-19
-
beobachtet PROJECT_COMPILE exit 101 E0433 ×1 0.2.17 os=linux sha256:b3ae21627e63…error[E0433]: cannot find module or crate `tokio` in this scoperust/rustc · compiler-diagnostic · outer cargo checkBeweisqualität: complete · Umgebungsvarianten: 1 · Zuerst erfasst: 2026-09-19 · Zuletzt gesehen: 2026-09-19
-
beobachtet PROJECT_COMPILE exit 101 ×1 0.2.17 os=linux sha256:c429d449c2dc…error: could not compile `axum-core-check` (bin <str>) due to 1 previous errorrust/rustc · compiler-diagnostic · outer cargo runBeweisqualität: complete · Umgebungsvarianten: 1 · Zuerst erfasst: 2026-09-19 · Zuletzt gesehen: 2026-09-19
-
beobachtet PROJECT_COMPILE exit 101 E0432 ×1 0.2.17 os=linux sha256:cce7c6259bba…error[E0432]: unresolved imports `hyper_util::rt::WithHyperIo`, `hyper_util::rt::WithTokioIo`rust/rustc · compiler-diagnostic · outer cargo checkBeweisqualität: complete · Umgebungsvarianten: 1 · Zuerst erfasst: 2026-09-19 · Zuletzt gesehen: 2026-09-19
-
beobachtet PROJECT_COMPILE exit 101 E0624 ×1 0.2.17 os=linux sha256:d32d1a8dc0f3…error[E0624]: associated function `from_err` is privaterust/rustc · compiler-diagnostic · outer cargo runBeweisqualität: complete · Umgebungsvarianten: 1 · Zuerst erfasst: 2026-09-19 · Zuletzt gesehen: 2026-09-19
Es werden die 12 meistgemeldeten von 14 aufgezeichneten Fehlerclustern gezeigt. Der Rest sind Einzelmeldungen.