Registroscargopin-project-lite0.2.17pin_project_lite::pin_project
Exemplos publicados
- pin-project-lite 0.2.17: pin_project! structs and enums containing unannotated PhantomPinned fields silently implement Unpin unless the marker field is explicitly marked #[pin] or #[project(!Unpin)] Esta rede oferece uma coisa: uma amostra que compila. Ela a executou em um sandbox e guardou o recibo assinado. Não classifica nem garante nada — se o mesmo código compila onde você está, ela não mediu. HOWpin_project_lite::pin_projectpin_project_lite::pin_project!rust MIT-0 · 2026-08-16
Matriz de compatibilidade
Observações no nível do projeto e verificações de símbolo/contrato são contadas separadamente e nunca somadas.
Estas contagens não distinguem como o símbolo foi chamado: sobrecargas, formatos de argumentos e opções são agrupados. O que uma forma de chamada específica faz é provado pelo contrato de uma amostra, não por estes números.
| Ambiente | Confiança | Observações | Verificado | Taxa de aprovação | Peers | Visto por último |
|---|---|---|---|---|---|---|
| rust 1 · Rust · cargo · linux musl · docker
Observações: PROJECT_TEST 1✓ — Verificado: CONTRACT 2✓
|
MEDIUM | 1 | 2 | 100% | 1 · 2✓ | 2026-09-08 |
snapshot · 2026-09-15
Clusters de falha
-
observado PROJECT_COMPILE exit 101 ×2 0.2.17 os=linux sha256:a67fd218023f…error: could not compile `test-hyper-util` (bin <str>) due to 1 previous errorrust/rustc · compiler-diagnostic · outer cargo runQualidade da evidência: complete · Variantes de ambiente: 1 · Primeiro registro: 2026-09-19 · Visto por último: 2026-09-19
-
observado PROJECT_TEST Lacuna de evidência ×1 0.2.17 executionContext=rust · os=linux · runtime=rust@1Qualidade da evidência: legacy-evidence-incomplete · Variantes de ambiente: 1 · Primeiro registro: 2026-09-08 · Visto por último: 2026-09-08
-
observado PROJECT_COMPILE exit 101 ×1 0.2.17 os=linux sha256:1043b6df5638…error: could not compile `test-hyper-util` (bin <str>) due to 1 previous error; 1 warning emittedrust/rustc · compiler-diagnostic · outer cargo checkQualidade da evidência: complete · Variantes de ambiente: 1 · Primeiro registro: 2026-09-19 · Visto por último: 2026-09-19
-
observado PROJECT_COMPILE exit 101 E0603 ×1 0.2.17 os=linux sha256:5200eda42d99…error[E0603]: module `error` is privaterust/rustc · compiler-diagnostic · outer cargo runQualidade da evidência: complete · Variantes de ambiente: 1 · Primeiro registro: 2026-09-19 · Visto por último: 2026-09-19
-
observado PROJECT_COMPILE exit 101 E0624 ×1 0.2.17 os=linux sha256:65fda95c6b71…error[E0624]: method `remaining` is privaterust/rustc · compiler-diagnostic · outer cargo runQualidade da evidência: complete · Variantes de ambiente: 1 · Primeiro registro: 2026-09-19 · Visto por último: 2026-09-19
-
observado PROJECT_COMPILE exit 101 E0599 ×1 0.2.17 os=linux sha256:689d8da7053d…error[E0599]: no method named `http1_only` found for mutable reference `&mut hyper_util::client::legacy::Builder` in the current scoperust/rustc · compiler-diagnostic · outer cargo runQualidade da evidência: complete · Variantes de ambiente: 1 · Primeiro registro: 2026-09-19 · Visto por último: 2026-09-19
-
observado PROJECT_COMPILE exit 101 E0433 ×1 0.2.17 os=linux sha256:addfa6ed2041…error[E0433]: cannot find module or crate `http` in this scoperust/rustc · compiler-diagnostic · outer cargo runQualidade da evidência: complete · Variantes de ambiente: 1 · Primeiro registro: 2026-09-19 · Visto por último: 2026-09-19
-
observado PROJECT_COMPILE exit 101 ×1 0.2.17 os=linux sha256:b35018818384…error: could not compile `axum-core-check` (bin <str>) due to 3 previous errorsrust/rustc · compiler-diagnostic · outer cargo runQualidade da evidência: complete · Variantes de ambiente: 1 · Primeiro registro: 2026-09-19 · Visto por último: 2026-09-19
-
observado PROJECT_COMPILE exit 101 E0433 ×1 0.2.17 os=linux sha256:b3ae21627e63…error[E0433]: cannot find module or crate `tokio` in this scoperust/rustc · compiler-diagnostic · outer cargo checkQualidade da evidência: complete · Variantes de ambiente: 1 · Primeiro registro: 2026-09-19 · Visto por último: 2026-09-19
-
observado PROJECT_COMPILE exit 101 ×1 0.2.17 os=linux sha256:c429d449c2dc…error: could not compile `axum-core-check` (bin <str>) due to 1 previous errorrust/rustc · compiler-diagnostic · outer cargo runQualidade da evidência: complete · Variantes de ambiente: 1 · Primeiro registro: 2026-09-19 · Visto por último: 2026-09-19
-
observado PROJECT_COMPILE exit 101 E0432 ×1 0.2.17 os=linux sha256:cce7c6259bba…error[E0432]: unresolved imports `hyper_util::rt::WithHyperIo`, `hyper_util::rt::WithTokioIo`rust/rustc · compiler-diagnostic · outer cargo checkQualidade da evidência: complete · Variantes de ambiente: 1 · Primeiro registro: 2026-09-19 · Visto por último: 2026-09-19
-
observado PROJECT_COMPILE exit 101 E0624 ×1 0.2.17 os=linux sha256:d32d1a8dc0f3…error[E0624]: associated function `from_err` is privaterust/rustc · compiler-diagnostic · outer cargo runQualidade da evidência: complete · Variantes de ambiente: 1 · Primeiro registro: 2026-09-19 · Visto por último: 2026-09-19
Mostrando os 12 mais relatados de 14 grupos de falhas registrados. O resto são relatos únicos.