Registroscargoixdtf0.6.6
Detalhe do ambiente
Observações no nível do projeto e verificações de símbolo/contrato são contadas separadamente e nunca somadas.
Estas contagens não distinguem como o símbolo foi chamado: sobrecargas, formatos de argumentos e opções são agrupados. O que uma forma de chamada específica faz é provado pelo contrato de uma amostra, não por estes números.
| Ambiente | Confiança | Observações | Verificado | Taxa de aprovação | Peers | Visto por último |
|---|---|---|---|---|---|---|
| unknown · Rust · cargo · linux glibc
Observações: PROJECT_COMPILE 0✓ 10✕ · PROJECT_PROCESS 3✓
|
ELEVATED FAILURE | 13 | 0 | 23% | 1 | 2026-09-20 |
Clusters de falha recentes
-
observado PROJECT_COMPILE exit 101 ×5 0.6.6 os=linux sha256:113664d7d918…error: could not compile `probe_icu` (bin <str>) due to 1 previous errorrust/rustc · compiler-diagnostic · outer cargo runQualidade da evidência: complete · Variantes de ambiente: 1 · Primeiro registro: 2026-09-20 · Visto por último: 2026-09-20
-
observado PROJECT_COMPILE exit 101 E0599 ×1 0.6.6 os=linux sha256:0fbd73add053…error[E0599]: no method named `is_empty` found for struct `Char16Trie<'data>` in the current scoperust/rustc · compiler-diagnostic · outer cargo runQualidade da evidência: complete · Variantes de ambiente: 1 · Primeiro registro: 2026-09-20 · Visto por último: 2026-09-20
-
observado PROJECT_COMPILE exit 101 E0599 ×1 0.6.6 os=linux sha256:16d23d1801b1…error[E0599]: no method named `normalize` found for struct `ComposingNormalizer` in the current scoperust/rustc · compiler-diagnostic · outer cargo runQualidade da evidência: complete · Variantes de ambiente: 1 · Primeiro registro: 2026-09-20 · Visto por último: 2026-09-20
-
observado PROJECT_COMPILE exit 101 E0599 ×1 0.6.6 os=linux sha256:267702ebcc26…error[E0599]: no associated function or constant named `new_nfc_unstable` found for struct `ComposingNormalizer` in the current scoperust/rustc · compiler-diagnostic · outer cargo runQualidade da evidência: complete · Variantes de ambiente: 1 · Primeiro registro: 2026-09-20 · Visto por último: 2026-09-20
-
observado PROJECT_COMPILE exit 101 E0609 ×1 0.6.6 os=linux sha256:463107715912…error[E0609]: no field `SINGLETON_NORMALIZER_NFC_V1` on type `MyProvider`rust/rustc · compiler-diagnostic · outer cargo runQualidade da evidência: complete · Variantes de ambiente: 1 · Primeiro registro: 2026-09-20 · Visto por último: 2026-09-20
-
observado PROJECT_COMPILE exit 101 E0599 ×1 0.6.6 os=linux sha256:f752258b26cc…error[E0599]: no method named `as_bytes` found for reference `&Char16Trie<'_>` in the current scoperust/rustc · compiler-diagnostic · outer cargo runQualidade da evidência: complete · Variantes de ambiente: 1 · Primeiro registro: 2026-09-20 · Visto por último: 2026-09-20
Símbolos
Ainda não há símbolos com evidências.