Recordscargoicu_plurals_data2.3.0
Change the conditions
Current conditions
icu_plurals_data @2.3.0ubuntu glibc · x64 · cargo 1
package-level total, not an API
3 of 13 passed
Observed — real project builds reported from this coordinate.
no sample at this coordinate yet
- Project observations
- 3 / 13
- Contract verifications
- nothing at this coordinate
- Independent reporting peers
- 1
- Last recorded
- 2026-09-20
Evidence you can open
Dependency Health
A resolution read this release's tree and found no dependencies. That is a measurement, not a missing one.
Recent failure clusters
-
observed PROJECT_COMPILE exit 101 ×5 2.3.0 os=linux sha256:113664d7d918…error: could not compile `probe_icu` (bin <str>) due to 1 previous errorrust/rustc · compiler-diagnostic · outer cargo runEvidence quality: complete · Environment variants: 1 · First recorded: 2026-09-20 · Last seen: 2026-09-20
-
observed PROJECT_COMPILE exit 101 E0599 ×1 2.3.0 os=linux sha256:0fbd73add053…error[E0599]: no method named `is_empty` found for struct `Char16Trie<'data>` in the current scoperust/rustc · compiler-diagnostic · outer cargo runEvidence quality: complete · Environment variants: 1 · First recorded: 2026-09-20 · Last seen: 2026-09-20
-
observed PROJECT_COMPILE exit 101 E0599 ×1 2.3.0 os=linux sha256:16d23d1801b1…error[E0599]: no method named `normalize` found for struct `ComposingNormalizer` in the current scoperust/rustc · compiler-diagnostic · outer cargo runEvidence quality: complete · Environment variants: 1 · First recorded: 2026-09-20 · Last seen: 2026-09-20
-
observed PROJECT_COMPILE exit 101 E0599 ×1 2.3.0 os=linux sha256:267702ebcc26…error[E0599]: no associated function or constant named `new_nfc_unstable` found for struct `ComposingNormalizer` in the current scoperust/rustc · compiler-diagnostic · outer cargo runEvidence quality: complete · Environment variants: 1 · First recorded: 2026-09-20 · Last seen: 2026-09-20
-
observed PROJECT_COMPILE exit 101 E0609 ×1 2.3.0 os=linux sha256:463107715912…error[E0609]: no field `SINGLETON_NORMALIZER_NFC_V1` on type `MyProvider`rust/rustc · compiler-diagnostic · outer cargo runEvidence quality: complete · Environment variants: 1 · First recorded: 2026-09-20 · Last seen: 2026-09-20
-
observed PROJECT_COMPILE exit 101 E0599 ×1 2.3.0 os=linux sha256:f752258b26cc…error[E0599]: no method named `as_bytes` found for reference `&Char16Trie<'_>` in the current scoperust/rustc · compiler-diagnostic · outer cargo runEvidence quality: complete · Environment variants: 1 · First recorded: 2026-09-20 · Last seen: 2026-09-20