Relevéscargoicu_list2.3.0
Détail de l'environnement
Les observations au niveau projet et les vérifications de symbole/contrat sont comptées séparément et jamais additionnées.
Ces chiffres ne distinguent pas la façon dont le symbole a été appelé : surcharges, formes d'arguments et options sont regroupées. Ce que fait une forme d'appel précise est prouvé par le contrat d'un échantillon, pas par ces nombres.
| Environnement | Confiance | Observations | Vérifié | Taux de réussite | Pairs | Dernière observation |
|---|---|---|---|---|---|---|
| unknown · Rust · cargo · linux glibc
Observations: PROJECT_COMPILE 0✓ 10✕ · PROJECT_PROCESS 3✓
|
ELEVATED FAILURE | 13 | 0 | 23 % | 1 | 2026-09-20 |
| rust 1 · Rust · cargo · linux musl · docker
Usage: USED 1✓
|
LOW | 0 +1 | 0 | — | 1 | 2026-10-09 |
Clusters d'échecs récents
-
observé PROJECT_COMPILE exit 101 ×5 2.3.0 os=linux sha256:113664d7d918…error: could not compile `probe_icu` (bin <str>) due to 1 previous errorrust/rustc · compiler-diagnostic · outer cargo runQualité de preuve: complete · Variantes d’environnement: 1 · Premier relevé: 2026-09-20 · Dernière observation: 2026-09-20
-
observé PROJECT_COMPILE exit 101 E0599 ×1 2.3.0 os=linux sha256:0fbd73add053…error[E0599]: no method named `is_empty` found for struct `Char16Trie<'data>` in the current scoperust/rustc · compiler-diagnostic · outer cargo runQualité de preuve: complete · Variantes d’environnement: 1 · Premier relevé: 2026-09-20 · Dernière observation: 2026-09-20
-
observé PROJECT_COMPILE exit 101 E0599 ×1 2.3.0 os=linux sha256:16d23d1801b1…error[E0599]: no method named `normalize` found for struct `ComposingNormalizer` in the current scoperust/rustc · compiler-diagnostic · outer cargo runQualité de preuve: complete · Variantes d’environnement: 1 · Premier relevé: 2026-09-20 · Dernière observation: 2026-09-20
-
observé PROJECT_COMPILE exit 101 E0599 ×1 2.3.0 os=linux sha256:267702ebcc26…error[E0599]: no associated function or constant named `new_nfc_unstable` found for struct `ComposingNormalizer` in the current scoperust/rustc · compiler-diagnostic · outer cargo runQualité de preuve: complete · Variantes d’environnement: 1 · Premier relevé: 2026-09-20 · Dernière observation: 2026-09-20
-
observé PROJECT_COMPILE exit 101 E0609 ×1 2.3.0 os=linux sha256:463107715912…error[E0609]: no field `SINGLETON_NORMALIZER_NFC_V1` on type `MyProvider`rust/rustc · compiler-diagnostic · outer cargo runQualité de preuve: complete · Variantes d’environnement: 1 · Premier relevé: 2026-09-20 · Dernière observation: 2026-09-20
-
observé PROJECT_COMPILE exit 101 E0599 ×1 2.3.0 os=linux sha256:f752258b26cc…error[E0599]: no method named `as_bytes` found for reference `&Char16Trie<'_>` in the current scoperust/rustc · compiler-diagnostic · outer cargo runQualité de preuve: complete · Variantes d’environnement: 1 · Premier relevé: 2026-09-20 · Dernière observation: 2026-09-20
Symboles
Pas encore de symboles avec des preuves.