기록cargoicu_decimal2.3.0
환경 상세
프로젝트 수준 관측과 심벌/컨트랙트 검증은 따로 집계하며 절대 합산하지 않습니다.
이 수치는 심볼을 어떻게 호출했는지 구분하지 않습니다. 오버로드, 인자 형태, 옵션이 한데 묶여 집계됩니다. 특정 호출 형태가 어떻게 동작하는지는 이 숫자가 아니라 샘플의 계약이 증명합니다.
| 환경 | 신뢰도 | 관측 | 검증 | 통과율 | 피어 | 마지막 관측 |
|---|---|---|---|---|---|---|
| unknown · Rust · cargo · linux glibc
관측: PROJECT_COMPILE 0✓ 10✕ · PROJECT_PROCESS 3✓
|
ELEVATED FAILURE | 13 | 0 | 23% | 1 | 2026-09-20 |
| rust 1 · Rust · cargo · linux musl · docker
사용: USED 1✓
|
LOW | 0 +1 | 0 | — | 1 | 2026-10-09 |
최근 실패 클러스터
-
관측됨 PROJECT_COMPILE exit 101 ×5 2.3.0 os=linux sha256:113664d7d918…error: could not compile `probe_icu` (bin <str>) due to 1 previous errorrust/rustc · compiler-diagnostic · outer cargo run증거 품질: complete · 환경 변형: 1 · 최초 관측: 2026-09-20 · 마지막 관측: 2026-09-20
-
관측됨 PROJECT_COMPILE exit 101 E0599 ×1 2.3.0 os=linux sha256:0fbd73add053…error[E0599]: no method named `is_empty` found for struct `Char16Trie<'data>` in the current scoperust/rustc · compiler-diagnostic · outer cargo run증거 품질: complete · 환경 변형: 1 · 최초 관측: 2026-09-20 · 마지막 관측: 2026-09-20
-
관측됨 PROJECT_COMPILE exit 101 E0599 ×1 2.3.0 os=linux sha256:16d23d1801b1…error[E0599]: no method named `normalize` found for struct `ComposingNormalizer` in the current scoperust/rustc · compiler-diagnostic · outer cargo run증거 품질: complete · 환경 변형: 1 · 최초 관측: 2026-09-20 · 마지막 관측: 2026-09-20
-
관측됨 PROJECT_COMPILE exit 101 E0599 ×1 2.3.0 os=linux sha256:267702ebcc26…error[E0599]: no associated function or constant named `new_nfc_unstable` found for struct `ComposingNormalizer` in the current scoperust/rustc · compiler-diagnostic · outer cargo run증거 품질: complete · 환경 변형: 1 · 최초 관측: 2026-09-20 · 마지막 관측: 2026-09-20
-
관측됨 PROJECT_COMPILE exit 101 E0609 ×1 2.3.0 os=linux sha256:463107715912…error[E0609]: no field `SINGLETON_NORMALIZER_NFC_V1` on type `MyProvider`rust/rustc · compiler-diagnostic · outer cargo run증거 품질: complete · 환경 변형: 1 · 최초 관측: 2026-09-20 · 마지막 관측: 2026-09-20
-
관측됨 PROJECT_COMPILE exit 101 E0599 ×1 2.3.0 os=linux sha256:f752258b26cc…error[E0599]: no method named `as_bytes` found for reference `&Char16Trie<'_>` in the current scoperust/rustc · compiler-diagnostic · outer cargo run증거 품질: complete · 환경 변형: 1 · 최초 관측: 2026-09-20 · 마지막 관측: 2026-09-20
심벌
아직 증거가 있는 심벌이 없습니다.