Aufzeichnungencargoicu2.3.0
Bedingungen ändern
Aktuelle Bedingungen
icu @2.3.0alpine musl · x64 · rust 1 · cargo · rust
Paketsumme, keine API
1 von 1 bestanden
Verifiziert — dieses Netzwerk hat an dieser Koordinate einen Contract ausgeführt.
hier gibt es ein Sample, und unser Lauf an dieser Koordinate kam sauber zurück (1)
- Projektbeobachtungen
- 4 / 4
- Contract-Verifikationen
- 1 / 1
- Nutzungsdatensätze
- 2
- Unabhängig meldende Peers
- 1
- Zuletzt erfasst
- 2026-10-13
Abhängigkeits-Zustand
Beobachtete Kombinationen und Fehlernachweise für dieses Release
Beobachtete Probleme: 1 ·
Stabil: 17
Erster beobachteter Fehler
2.3.0
linux
5 FAIL
· stage: PROJECT_COMPILE
· fingerprint: sha256:113664d7d9181e86107a4fb50e44d53895730e410223b707c0b72d659b247aef
| Bibliothek | Version | Zustand | Dort gemessen | Projekte |
|---|---|---|---|---|
| icu_calendar | 2.3.0 | PASS Alle Beobachtungen bestanden | Builds beobachtet | 4 Projekttage |
| icu_casemap | 2.3.0 | PASS Alle Beobachtungen bestanden | Builds beobachtet | 4 Projekttage |
| icu_collator | 2.3.1 | PASS Alle Beobachtungen bestanden | Builds beobachtet | 4 Projekttage |
| icu_collections | 2.3.0 | PASS Alle Beobachtungen bestanden | Contract bestanden | 4 Projekttage |
| icu_datetime | 2.3.0 | PASS Alle Beobachtungen bestanden | Builds beobachtet | 4 Projekttage |
| icu_decimal | 2.3.0 | PASS Alle Beobachtungen bestanden | Builds beobachtet | 4 Projekttage |
| icu_experimental | 0.6.0 | PASS Alle Beobachtungen bestanden | Builds beobachtet | 4 Projekttage |
| icu_list | 2.3.0 | PASS Alle Beobachtungen bestanden | Builds beobachtet | 4 Projekttage |
| icu_locale | 2.3.1 | PASS Alle Beobachtungen bestanden | Builds beobachtet | 4 Projekttage |
| icu_normalizer | 2.3.0 | PASS Alle Beobachtungen bestanden | Builds beobachtet | 4 Projekttage |
| icu_pattern | 0.5.0 | PASS Alle Beobachtungen bestanden | Builds beobachtet | 4 Projekttage |
| icu_plurals | 2.3.0 | PASS Alle Beobachtungen bestanden | Builds beobachtet | 4 Projekttage |
| icu_properties | 2.3.0 | PASS Alle Beobachtungen bestanden | Contract bestanden | 4 Projekttage |
| icu_provider | 2.3.0 | PASS Alle Beobachtungen bestanden | Builds beobachtet | 1 Projekttag |
| icu_provider | 2.3.1 | PASS Alle Beobachtungen bestanden | Contract bestanden | 3 Projekttage |
| icu_segmenter | 2.3.0 | PASS Alle Beobachtungen bestanden | Builds beobachtet | 3 Projekttage |
| icu_time | 2.3.0 | PASS Alle Beobachtungen bestanden | Builds beobachtet | 2 Projekttage |
Die Messspalte betrifft das Release der jeweiligen Abhängigkeit selbst, nicht das Paar. Dass ein Resolver zwei Releases nebeneinandergestellt hat, ist kein Beleg dafür, dass sie zusammen funktionieren.
Aktuelle Fehler-Cluster
-
beobachtet PROJECT_COMPILE exit 101 ×5 2.3.0 os=linux sha256:113664d7d918…error: could not compile `probe_icu` (bin <str>) due to 1 previous errorrust/rustc · compiler-diagnostic · outer cargo runBeweisqualität: complete · Umgebungsvarianten: 1 · Zuerst erfasst: 2026-09-20 · Zuletzt gesehen: 2026-09-20
-
beobachtet PROJECT_COMPILE exit 101 E0599 ×1 2.3.0 os=linux sha256:0fbd73add053…error[E0599]: no method named `is_empty` found for struct `Char16Trie<'data>` in the current scoperust/rustc · compiler-diagnostic · outer cargo runBeweisqualität: complete · Umgebungsvarianten: 1 · Zuerst erfasst: 2026-09-20 · Zuletzt gesehen: 2026-09-20
-
beobachtet PROJECT_COMPILE exit 101 E0599 ×1 2.3.0 os=linux sha256:16d23d1801b1…error[E0599]: no method named `normalize` found for struct `ComposingNormalizer` in the current scoperust/rustc · compiler-diagnostic · outer cargo runBeweisqualität: complete · Umgebungsvarianten: 1 · Zuerst erfasst: 2026-09-20 · Zuletzt gesehen: 2026-09-20
-
beobachtet PROJECT_COMPILE exit 101 E0599 ×1 2.3.0 os=linux sha256:267702ebcc26…error[E0599]: no associated function or constant named `new_nfc_unstable` found for struct `ComposingNormalizer` in the current scoperust/rustc · compiler-diagnostic · outer cargo runBeweisqualität: complete · Umgebungsvarianten: 1 · Zuerst erfasst: 2026-09-20 · Zuletzt gesehen: 2026-09-20
-
beobachtet PROJECT_COMPILE exit 101 E0609 ×1 2.3.0 os=linux sha256:463107715912…error[E0609]: no field `SINGLETON_NORMALIZER_NFC_V1` on type `MyProvider`rust/rustc · compiler-diagnostic · outer cargo runBeweisqualität: complete · Umgebungsvarianten: 1 · Zuerst erfasst: 2026-09-20 · Zuletzt gesehen: 2026-09-20
-
beobachtet PROJECT_COMPILE exit 101 E0599 ×1 2.3.0 os=linux sha256:f752258b26cc…error[E0599]: no method named `as_bytes` found for reference `&Char16Trie<'_>` in the current scoperust/rustc · compiler-diagnostic · outer cargo runBeweisqualität: complete · Umgebungsvarianten: 1 · Zuerst erfasst: 2026-09-20 · Zuletzt gesehen: 2026-09-20