Aufzeichnungencargoicu2.3.0
Welches Symbol wo lief
Symbole × Betriebssysteme für diese Version. Zellen führen in den Kompatibilitätswürfel des Pakets.
Eine Zelle lesen: Die Zahl sind die aufgezeichneten Beobachtungen, durch die die Rate teilt — ein Build hinterlässt pro erreichter Stufe eine Beobachtung, also zählt sie weder Builds noch Maschinen noch Personen. Das Dokument daneben ist eine andere Tatsache aus einer anderen Quelle: ob an dieser Koordinate ein Sample existiert und wie unser eigener Lauf davon dort ausging.
- an dieser Koordinate noch kein Sample
- hier gibt es ein Sample, und wir haben es an dieser Koordinate noch nicht ausgeführt
- hier gibt es ein Sample, und unser Lauf an dieser Koordinate kam sauber zurück
- hier gibt es ein Sample, und unser Lauf an dieser Koordinate ist fehlgeschlagen
- hier gibt es ein Sample, und an dieser Koordinate sind ein bestandener und ein fehlgeschlagener Lauf verzeichnet
- nichts aufgezeichnet — unbekannt, weder „funktioniert“ noch „defekt“
- unter dieser Zelle liegt eine Ebene — zum Öffnen klicken
Ein Dokument bedeutet: An dieser Koordinate gibt es ein Sample. DASS es existiert, ist eine Aussage über diese Version und diese API und ändert sich nicht mit Betriebssystem, Runtime oder Paketmanager; seine FARBE sagt, wie dieses Sample in der Umgebung gelaufen ist, die Sie gerade ansehen.
Umgebungsdetails
Beobachtungen auf Projektebene und Symbol-/Contract-Verifizierungen werden getrennt gezählt und niemals zusammengerechnet.
Diese Zahlen unterscheiden nicht, wie das Symbol aufgerufen wurde: Überladungen, Argumentformen und Optionen werden zusammengefasst. Was eine bestimmte Aufrufform tut, beweist der Vertrag eines Samples – nicht diese Zahlen.
| Umgebung | Konfidenz | Beobachtungen | Verifiziert | Erfolgsquote | Peers | Zuletzt gesehen |
|---|---|---|---|---|---|---|
| unknown · Rust · cargo · linux glibc
Beobachtungen: PROJECT_COMPILE 0✓ 10✕ · PROJECT_PROCESS 3✓
|
ELEVATED FAILURE | 13 | 0 | 23 % | 1 | 2026-09-20 |
| rust 1 · Rust · cargo · linux musl · docker
Beobachtungen: PROJECT_LOAD 2✓ · PROJECT_TEST 2✓ — Nutzung: USED 2✓ — Verifiziert: CONTRACT 1✓
|
LOW | 4 +2 | 1 | 100 % | 1 · 1✓ | 2026-10-13 |
Aktuelle Fehler-Cluster
-
beobachtet PROJECT_COMPILE exit 101 ×5 2.3.0 os=linux icu::normalizer::ComposingNormalizer sha256:113664d7d918…error: could not compile `probe_icu` (bin <str>) due to 1 previous errorrust/rustc · compiler-diagnostic · outer cargo runBeweisqualität: complete · Umgebungsvarianten: 1 · Zuerst erfasst: 2026-09-20 · Zuletzt gesehen: 2026-09-20
-
beobachtet PROJECT_COMPILE exit 101 E0599 ×1 2.3.0 os=linux sha256:0fbd73add053…error[E0599]: no method named `is_empty` found for struct `Char16Trie<'data>` in the current scoperust/rustc · compiler-diagnostic · outer cargo runBeweisqualität: complete · Umgebungsvarianten: 1 · Zuerst erfasst: 2026-09-20 · Zuletzt gesehen: 2026-09-20
-
beobachtet PROJECT_COMPILE exit 101 E0599 ×1 2.3.0 os=linux icu::normalizer::ComposingNormalizer sha256:16d23d1801b1…error[E0599]: no method named `normalize` found for struct `ComposingNormalizer` in the current scoperust/rustc · compiler-diagnostic · outer cargo runBeweisqualität: complete · Umgebungsvarianten: 1 · Zuerst erfasst: 2026-09-20 · Zuletzt gesehen: 2026-09-20
-
beobachtet PROJECT_COMPILE exit 101 E0599 ×1 2.3.0 os=linux icu::normalizer::ComposingNormalizer sha256:267702ebcc26…error[E0599]: no associated function or constant named `new_nfc_unstable` found for struct `ComposingNormalizer` in the current scoperust/rustc · compiler-diagnostic · outer cargo runBeweisqualität: complete · Umgebungsvarianten: 1 · Zuerst erfasst: 2026-09-20 · Zuletzt gesehen: 2026-09-20
-
beobachtet PROJECT_COMPILE exit 101 E0609 ×1 2.3.0 os=linux sha256:463107715912…error[E0609]: no field `SINGLETON_NORMALIZER_NFC_V1` on type `MyProvider`rust/rustc · compiler-diagnostic · outer cargo runBeweisqualität: complete · Umgebungsvarianten: 1 · Zuerst erfasst: 2026-09-20 · Zuletzt gesehen: 2026-09-20
-
beobachtet PROJECT_COMPILE exit 101 E0599 ×1 2.3.0 os=linux sha256:f752258b26cc…error[E0599]: no method named `as_bytes` found for reference `&Char16Trie<'_>` in the current scoperust/rustc · compiler-diagnostic · outer cargo runBeweisqualität: complete · Umgebungsvarianten: 1 · Zuerst erfasst: 2026-09-20 · Zuletzt gesehen: 2026-09-20
Symbole
Veröffentlichte Beispiele
- icu 2.3.0 Dieses Netzwerk bietet eine Sache: ein Sample, das baut. Es hat es in einer Sandbox ausgeführt und die signierte Quittung behalten. Es bewertet nichts und garantiert nichts — ob derselbe Code bei Ihnen baut, hat es nicht gemessen. HOW MIT-0 · 2026-10-09