Recordscargoicu2.3.0icu::normalizer::ComposingNormalizer
Compatibility matrix
Project-level observations and symbol/contract verifications are counted separately and never combined.
These counts do not distinguish how the symbol was called: overloads, argument shapes and options are pooled together. What a particular call shape does is proven by a sample's contract, not by these numbers.
| Environment | Confidence | Observations | Verified | Pass rate | Peers | Last seen |
|---|---|---|---|---|---|---|
| unknown · Rust · cargo · linux glibc
Observations: PROJECT_COMPILE 0✓ 4✕ · PROJECT_PROCESS 1✓
|
ELEVATED FAILURE | 5 | 0 | 20% | 1 | 2026-09-20 |
snapshot · 2026-10-09
Failure clusters
-
observed PROJECT_COMPILE exit 101 ×5 2.3.0 os=linux icu::normalizer::ComposingNormalizer sha256:113664d7d918…error: could not compile `probe_icu` (bin <str>) due to 1 previous errorrust/rustc · compiler-diagnostic · outer cargo runEvidence quality: complete · Environment variants: 1 · First recorded: 2026-09-20 · Last seen: 2026-09-20
-
observed PROJECT_COMPILE exit 101 E0599 ×1 2.3.0 os=linux sha256:0fbd73add053…error[E0599]: no method named `is_empty` found for struct `Char16Trie<'data>` in the current scoperust/rustc · compiler-diagnostic · outer cargo runEvidence quality: complete · Environment variants: 1 · First recorded: 2026-09-20 · Last seen: 2026-09-20
-
observed PROJECT_COMPILE exit 101 E0599 ×1 2.3.0 os=linux icu::normalizer::ComposingNormalizer sha256:16d23d1801b1…error[E0599]: no method named `normalize` found for struct `ComposingNormalizer` in the current scoperust/rustc · compiler-diagnostic · outer cargo runEvidence quality: complete · Environment variants: 1 · First recorded: 2026-09-20 · Last seen: 2026-09-20
-
observed PROJECT_COMPILE exit 101 E0599 ×1 2.3.0 os=linux icu::normalizer::ComposingNormalizer sha256:267702ebcc26…error[E0599]: no associated function or constant named `new_nfc_unstable` found for struct `ComposingNormalizer` in the current scoperust/rustc · compiler-diagnostic · outer cargo runEvidence quality: complete · Environment variants: 1 · First recorded: 2026-09-20 · Last seen: 2026-09-20
-
observed PROJECT_COMPILE exit 101 E0609 ×1 2.3.0 os=linux sha256:463107715912…error[E0609]: no field `SINGLETON_NORMALIZER_NFC_V1` on type `MyProvider`rust/rustc · compiler-diagnostic · outer cargo runEvidence quality: complete · Environment variants: 1 · First recorded: 2026-09-20 · Last seen: 2026-09-20
-
observed PROJECT_COMPILE exit 101 E0599 ×1 2.3.0 os=linux sha256:f752258b26cc…error[E0599]: no method named `as_bytes` found for reference `&Char16Trie<'_>` in the current scoperust/rustc · compiler-diagnostic · outer cargo runEvidence quality: complete · Environment variants: 1 · First recorded: 2026-09-20 · Last seen: 2026-09-20