记录cargohyper1.11.1
环境详情
项目级观测与符号/契约验证分别统计,绝不合并。
这些计数不区分符号的调用方式:重载、参数形态和选项被合并统计。某一具体调用方式的行为由样本的契约证明,而不是由这些数字证明。
| 环境 | 置信度 | 观测 | 验证 | 通过率 | 节点 | 最近观测 |
|---|---|---|---|---|---|---|
| unknown · Rust · cargo · linux glibc
观测: PROJECT_COMPILE 3✓ 6✕ · PROJECT_PROCESS 6✓
|
ELEVATED FAILURE | 15 | 0 | 60% | 1 | 2026-09-19 |
近期失败聚类
-
已观测 PROJECT_COMPILE exit 101 ×2 1.11.1 os=linux sha256:a67fd218023f…error: could not compile `test-hyper-util` (bin <str>) due to 1 previous errorrust/rustc · compiler-diagnostic · outer cargo run证据质量: complete · 环境变体: 1 · 首次记录: 2026-09-19 · 最近观测: 2026-09-19
-
已观测 PROJECT_COMPILE exit 101 ×1 1.11.1 os=linux sha256:1043b6df5638…error: could not compile `test-hyper-util` (bin <str>) due to 1 previous error; 1 warning emittedrust/rustc · compiler-diagnostic · outer cargo check证据质量: complete · 环境变体: 1 · 首次记录: 2026-09-19 · 最近观测: 2026-09-19
-
已观测 PROJECT_COMPILE exit 101 E0599 ×1 1.11.1 os=linux sha256:689d8da7053d…error[E0599]: no method named `http1_only` found for mutable reference `&mut hyper_util::client::legacy::Builder` in the current scoperust/rustc · compiler-diagnostic · outer cargo run证据质量: complete · 环境变体: 1 · 首次记录: 2026-09-19 · 最近观测: 2026-09-19
-
已观测 PROJECT_COMPILE exit 101 E0433 ×1 1.11.1 os=linux sha256:b3ae21627e63…error[E0433]: cannot find module or crate `tokio` in this scoperust/rustc · compiler-diagnostic · outer cargo check证据质量: complete · 环境变体: 1 · 首次记录: 2026-09-19 · 最近观测: 2026-09-19
-
已观测 PROJECT_COMPILE exit 101 E0432 ×1 1.11.1 os=linux sha256:cce7c6259bba…error[E0432]: unresolved imports `hyper_util::rt::WithHyperIo`, `hyper_util::rt::WithTokioIo`rust/rustc · compiler-diagnostic · outer cargo check证据质量: complete · 环境变体: 1 · 首次记录: 2026-09-19 · 最近观测: 2026-09-19
符号
暂无带证据的符号。