Registroscargogimli0.32.3
Mudar as condições
Condições atuais
gimli @0.32.3ubuntu glibc · x64 · cargo 1
total do pacote, não uma API
0 de 2 passaram
Verificado — esta rede executou um contrato nesta coordenada.
há uma amostra aqui e nossa execução nesta coordenada falhou
- Observações de projetos
- 26 / 34
- Verificações de contrato
- 0 / 2
- Registros de uso
- 1
- Peers independentes que reportaram
- 1
- Último registro
- 2026-10-09
Evidências que você pode abrir
Saúde das dependências
Combinações observadas e evidências de falha para esta versão
Problemas observados: 1 ·
Estáveis: 2
Primeira quebra observada
0.32.3
linux
2 FAIL
· stage: PROJECT_COMPILE
· fingerprint: sha256:40827ed6270443985b87902d50b257ee40df217d061c0098b7070f9287145dc9
| Biblioteca | Versão | Saúde | Medido ali | Projetos |
|---|---|---|---|---|
| fallible-iterator | 0.3.0 | PASS Todas as observações passaram | contrato aprovado | 2 dias-projeto |
| stable_deref_trait | 1.2.1 | PASS Todas as observações passaram | contrato aprovado | 2 dias-projeto |
A coluna de medição é sobre a versão de cada dependência em si, não sobre o par. Um resolvedor ter colocado duas versões lado a lado não é prova de que funcionam juntas.
Clusters de falha recentes
-
observado PROJECT_COMPILE exit 101 E0599 ×2 0.32.3 os=linux sha256:40827ed62704…error[E0599]: no method named `is_none` found for tuple `(u64, u64, addr2line::Location<'_>)` in the current scoperust/rustc · compiler-diagnostic · outer cargo runQualidade da evidência: complete · Variantes de ambiente: 1 · Primeiro registro: 2026-09-19 · Visto por último: 2026-09-19
-
observado PROJECT_COMPILE exit 101 E0631 ×1 0.32.3 os=linux sha256:08581f58869b…error[E0631]: type mismatch in closure argumentsrust/rustc · compiler-diagnostic · outer cargo runQualidade da evidência: complete · Variantes de ambiente: 1 · Primeiro registro: 2026-09-19 · Visto por último: 2026-09-19
-
observado PROJECT_COMPILE exit 101 ×1 0.32.3 os=linux sha256:7e12f411f813…error: could not compile `test_addr2line` (bin <str>) due to 1 previous errorrust/rustc · compiler-diagnostic · outer cargo runQualidade da evidência: complete · Variantes de ambiente: 1 · Primeiro registro: 2026-09-19 · Visto por último: 2026-09-19
-
observado PROJECT_COMPILE exit 101 ×1 0.32.3 os=linux sha256:9d9b6169d6bd…error: could not compile `test_addr2line` (bin <str>) due to 9 previous errorsrust/rustc · compiler-diagnostic · outer cargo runQualidade da evidência: complete · Variantes de ambiente: 1 · Primeiro registro: 2026-09-19 · Visto por último: 2026-09-19
-
observado PROJECT_COMPILE exit 101 E0063 ×1 0.32.3 os=linux sha256:b4d73c642e61…error[E0063]: missing fields `debug_macinfo` and `debug_macro` in initializer of `Dwarf<_>`rust/rustc · compiler-diagnostic · outer cargo runQualidade da evidência: complete · Variantes de ambiente: 1 · Primeiro registro: 2026-09-19 · Visto por último: 2026-09-19
-
observado PROJECT_COMPILE exit 101 ×1 0.32.3 os=linux sha256:b7e6301755e9…error: could not compile `test-bt` (bin <str>) due to 2 previous errorsrust/rustc · compiler-diagnostic · outer cargo runQualidade da evidência: complete · Variantes de ambiente: 1 · Primeiro registro: 2026-09-19 · Visto por último: 2026-09-19
-
observado PROJECT_COMPILE exit 101 E0061 ×1 0.32.3 os=linux sha256:db7a3103c11e…error[E0061]: this function takes 2 arguments but 1 argument was suppliedrust/rustc · compiler-diagnostic · outer cargo runQualidade da evidência: complete · Variantes de ambiente: 1 · Primeiro registro: 2026-09-19 · Visto por último: 2026-09-19
-
observado UNKNOWN signal ABORTED Lacuna de evidência ×1 0.32.3 os=linux sha256:b0a63bccc458…Compiling object v0.37.3 · Compiling libc v0.2.189 · Compiling adler2 v2.0.1 · Compiling gimli v0.32.3cargo · unclassified-diagnostic · outer cargo run · gap stage-unknownQualidade da evidência: complete · Variantes de ambiente: 1 · Primeiro registro: 2026-09-20 · Visto por último: 2026-09-20Candidato a reverificação diagnóstica
-
observado UNKNOWN exit 101 Lacuna de evidência ×1 0.32.3 os=linux sha256:c970c257481f…Compiling cfg-if v1.0.5 · Compiling simd-adler32 v0.3.10 · Compiling adler2 v2.0.1 · Compiling crc32fast v1.5.2cargo · unclassified-diagnostic · outer cargo run · gap stage-unknownQualidade da evidência: complete · Variantes de ambiente: 1 · Primeiro registro: 2026-09-19 · Visto por último: 2026-09-19Candidato a reverificação diagnóstica