Записиcargofutures-core0.3.34
Изменить условия
Текущие условия
futures-core @0.3.34ubuntu glibc · x64 · cargo 1
итог по пакету, а не API
4 из 9 прошли
Наблюдение — реальные сборки проектов сообщили об этой координате.
образец есть — в этой координате мы его ещё не запускали (2)
- Наблюдения в проектах
- 4 / 9
- Проверки контрактом
- в этой координате ничего
- Записи об использовании
- 2
- Независимые сообщившие пиры
- 1
- Последняя запись
- 2026-09-15
Свидетельства, которые можно открыть
Здоровье зависимостей
Разрешение прочитало дерево этого релиза и не нашло зависимостей. Это измерение, а не его отсутствие.
Недавние кластеры сбоев
-
наблюдалось PROJECT_COMPILE exit 101 E0277 ×1 0.3.34 os=linux sha256:079d54d4b2e3…error[E0277]: `T` cannot be unpinned · error[E0277]: `E` cannot be unpinnedrust/rustc · compiler-diagnostic · outer cargo runКачество данных: complete · Варианты среды: 1 · Первая запись: 2026-09-15 · Последнее наблюдение: 2026-09-15
-
наблюдалось PROJECT_COMPILE exit 101 E0596 ×1 0.3.34 os=linux sha256:543987e39480…error[E0596]: cannot borrow data in dereference of `Pin<&mut ReadyTryFuture<T, E>>` as mutablerust/rustc · compiler-diagnostic · outer cargo runКачество данных: complete · Варианты среды: 1 · Первая запись: 2026-09-15 · Последнее наблюдение: 2026-09-15
-
наблюдалось PROJECT_COMPILE exit 101 E0119 ×1 0.3.34 os=linux sha256:5fe0d0b2f0ce…error[E0119]: conflicting implementations of trait `TryFuture` for type `ReadyTryFuture<_, _>`rust/rustc · compiler-diagnostic · outer cargo runКачество данных: complete · Варианты среды: 1 · Первая запись: 2026-09-15 · Последнее наблюдение: 2026-09-15
-
наблюдалось PROJECT_COMPILE exit 101 ×1 0.3.34 os=linux sha256:8f6f2276b3f1…error: could not compile `sample-futures-core` (bin <str>) due to 2 previous errors; 1 warning emittedrust/rustc · compiler-diagnostic · outer cargo runКачество данных: complete · Варианты среды: 1 · Первая запись: 2026-09-15 · Последнее наблюдение: 2026-09-15
-
наблюдалось PROJECT_COMPILE exit 101 ×1 0.3.34 os=linux sha256:e3dee1f39a56…error: could not compile `sample-futures-core` (bin <str>) due to 2 previous errorsrust/rustc · compiler-diagnostic · outer cargo runКачество данных: complete · Варианты среды: 1 · Первая запись: 2026-09-15 · Последнее наблюдение: 2026-09-15