Записиcargofutures-core0.3.34futures_core
Изменить условия
Текущие условия
futures_core @0.3.34alpine musl · x64 · rust 1 · cargo · rust
1 из 1 прошли
Проверено — эта сеть выполнила контракт в этой координате.
образец есть — наш запуск в этой координате завершился чисто (1)
- Наблюдения в проектах
- 2 / 2
- Проверки контрактом
- 1 / 1
- Независимые сообщившие пиры
- 1
- Последняя запись
- 2026-09-17
Свидетельства, которые можно открыть
Здоровье зависимостей
Разрешение прочитало дерево этого релиза и не нашло зависимостей. Это измерение, а не его отсутствие.
Недавние кластеры сбоев
-
наблюдалось PROJECT_COMPILE exit 101 E0277 ×1 0.3.34 os=linux futures_core sha256:079d54d4b2e3…error[E0277]: `T` cannot be unpinned · error[E0277]: `E` cannot be unpinnedrust/rustc · compiler-diagnostic · outer cargo runКачество данных: complete · Варианты среды: 1 · Первая запись: 2026-09-15 · Последнее наблюдение: 2026-09-15
-
наблюдалось PROJECT_COMPILE exit 101 E0596 ×1 0.3.34 os=linux futures_core sha256:543987e39480…error[E0596]: cannot borrow data in dereference of `Pin<&mut ReadyTryFuture<T, E>>` as mutablerust/rustc · compiler-diagnostic · outer cargo runКачество данных: complete · Варианты среды: 1 · Первая запись: 2026-09-15 · Последнее наблюдение: 2026-09-15
-
наблюдалось PROJECT_COMPILE exit 101 E0119 ×1 0.3.34 os=linux futures_core sha256:5fe0d0b2f0ce…error[E0119]: conflicting implementations of trait `TryFuture` for type `ReadyTryFuture<_, _>`rust/rustc · compiler-diagnostic · outer cargo runКачество данных: complete · Варианты среды: 1 · Первая запись: 2026-09-15 · Последнее наблюдение: 2026-09-15
-
наблюдалось PROJECT_COMPILE exit 101 ×1 0.3.34 os=linux futures_core sha256:8f6f2276b3f1…error: could not compile `sample-futures-core` (bin <str>) due to 2 previous errors; 1 warning emittedrust/rustc · compiler-diagnostic · outer cargo runКачество данных: complete · Варианты среды: 1 · Первая запись: 2026-09-15 · Последнее наблюдение: 2026-09-15
-
наблюдалось PROJECT_COMPILE exit 101 ×1 0.3.34 os=linux futures_core sha256:e3dee1f39a56…error: could not compile `sample-futures-core` (bin <str>) due to 2 previous errorsrust/rustc · compiler-diagnostic · outer cargo runКачество данных: complete · Варианты среды: 1 · Первая запись: 2026-09-15 · Последнее наблюдение: 2026-09-15