기록cargofutures-core0.3.34futures_core
공개한 샘플
- futures-core 0.3.34: futures_core 이 네트워크가 제공하는 것은 하나입니다. 빌드되는 샘플. 샌드박스에서 돌리고 서명된 영수증을 보관합니다. 등급을 매기지 않고 무엇도 보증하지 않습니다 — 같은 코드가 당신 환경에서 빌드되는지는 측정한 적이 없습니다. HOWfutures_core MIT-0 · 2026-09-15
호환성 매트릭스
프로젝트 수준 관측과 심벌/컨트랙트 검증은 따로 집계하며 절대 합산하지 않습니다.
이 수치는 심볼을 어떻게 호출했는지 구분하지 않습니다. 오버로드, 인자 형태, 옵션이 한데 묶여 집계됩니다. 특정 호출 형태가 어떻게 동작하는지는 이 숫자가 아니라 샘플의 계약이 증명합니다.
| 환경 | 신뢰도 | 관측 | 검증 | 통과율 | 피어 | 마지막 관측 |
|---|---|---|---|---|---|---|
| unknown · Rust · cargo · linux glibc
관측: PROJECT_COMPILE 0✓ 5✕ · PROJECT_PROCESS 2✓
|
ELEVATED FAILURE | 7 | 0 | 29% | 1 | 2026-09-15 |
| rust 1 · Rust · cargo · linux musl · docker
관측: PROJECT_TEST 2✓ — 검증: CONTRACT 1✓
|
LOW | 2 | 1 | 100% | 1 · 1✓ | 2026-09-17 |
snapshot · 2026-09-17
실패 클러스터
-
관측됨 PROJECT_COMPILE exit 101 E0277 ×1 0.3.34 os=linux futures_core sha256:079d54d4b2e3…error[E0277]: `T` cannot be unpinned · error[E0277]: `E` cannot be unpinnedrust/rustc · compiler-diagnostic · outer cargo run증거 품질: complete · 환경 변형: 1 · 최초 관측: 2026-09-15 · 마지막 관측: 2026-09-15
-
관측됨 PROJECT_COMPILE exit 101 E0596 ×1 0.3.34 os=linux futures_core sha256:543987e39480…error[E0596]: cannot borrow data in dereference of `Pin<&mut ReadyTryFuture<T, E>>` as mutablerust/rustc · compiler-diagnostic · outer cargo run증거 품질: complete · 환경 변형: 1 · 최초 관측: 2026-09-15 · 마지막 관측: 2026-09-15
-
관측됨 PROJECT_COMPILE exit 101 E0119 ×1 0.3.34 os=linux futures_core sha256:5fe0d0b2f0ce…error[E0119]: conflicting implementations of trait `TryFuture` for type `ReadyTryFuture<_, _>`rust/rustc · compiler-diagnostic · outer cargo run증거 품질: complete · 환경 변형: 1 · 최초 관측: 2026-09-15 · 마지막 관측: 2026-09-15
-
관측됨 PROJECT_COMPILE exit 101 ×1 0.3.34 os=linux futures_core sha256:8f6f2276b3f1…error: could not compile `sample-futures-core` (bin <str>) due to 2 previous errors; 1 warning emittedrust/rustc · compiler-diagnostic · outer cargo run증거 품질: complete · 환경 변형: 1 · 최초 관측: 2026-09-15 · 마지막 관측: 2026-09-15
-
관측됨 PROJECT_COMPILE exit 101 ×1 0.3.34 os=linux futures_core sha256:e3dee1f39a56…error: could not compile `sample-futures-core` (bin <str>) due to 2 previous errorsrust/rustc · compiler-diagnostic · outer cargo run증거 품질: complete · 환경 변형: 1 · 최초 관측: 2026-09-15 · 마지막 관측: 2026-09-15