기록cargofind-msvc-tools0.1.12
환경 상세
프로젝트 수준 관측과 심벌/컨트랙트 검증은 따로 집계하며 절대 합산하지 않습니다.
이 수치는 심볼을 어떻게 호출했는지 구분하지 않습니다. 오버로드, 인자 형태, 옵션이 한데 묶여 집계됩니다. 특정 호출 형태가 어떻게 동작하는지는 이 숫자가 아니라 샘플의 계약이 증명합니다.
| 환경 | 신뢰도 | 관측 | 검증 | 통과율 | 피어 | 마지막 관측 |
|---|---|---|---|---|---|---|
| unknown · Rust · cargo · linux glibc
관측: PROJECT_COMPILE 2✓ 7✕ · PROJECT_PROCESS 10✓ — 검증: UNKNOWN 0✓ 4✕
|
ELEVATED FAILURE | 19 | 4 | 52% | 1 | 2026-09-19 |
최근 실패 클러스터
-
관측됨 PROJECT_COMPILE exit 101 ×1 0.1.12 os=linux sha256:104f536c9704…error: could not compile `probe` (bin <str>) due to 2 previous errorsrust/rustc · compiler-diagnostic · outer cargo run증거 품질: complete · 환경 변형: 1 · 최초 관측: 2026-09-19 · 마지막 관측: 2026-09-19
-
관측됨 PROJECT_COMPILE exit 101 E0599 ×1 0.1.12 os=linux sha256:5b0ef21330f9…error[E0599]: no associated function or constant named `SERVER_AUTH` found for struct `KeyPurposeId<'a>` in the current scoperust/rustc · compiler-diagnostic · outer cargo check증거 품질: complete · 환경 변형: 1 · 최초 관측: 2026-09-19 · 마지막 관측: 2026-09-19
-
관측됨 PROJECT_COMPILE exit 101 E0599 ×1 0.1.12 os=linux sha256:8c25141af213…error[E0599]: no variant, associated function, or constant named `CACompromise` found for enum `webpki::RevocationReason` in the current scoperust/rustc · compiler-diagnostic · outer cargo run증거 품질: complete · 환경 변형: 1 · 최초 관측: 2026-09-19 · 마지막 관측: 2026-09-19
-
관측됨 PROJECT_COMPILE exit 101 E0423 ×1 0.1.12 os=linux sha256:a4ccb879052a…error[E0423]: cannot initialize a tuple struct which contains private fieldsrust/rustc · compiler-diagnostic · outer cargo run증거 품질: complete · 환경 변형: 1 · 최초 관측: 2026-09-19 · 마지막 관측: 2026-09-19
-
관측됨 PROJECT_COMPILE exit 101 E0133 ×1 0.1.12 os=linux sha256:b3defba5e9b3…error[E0133]: call to unsafe function `set_var` is unsafe and requires unsafe blockrust/rustc · compiler-diagnostic · outer cargo run증거 품질: complete · 환경 변형: 1 · 최초 관측: 2026-09-19 · 마지막 관측: 2026-09-19
-
관측됨 PROJECT_COMPILE exit 101 ×1 0.1.12 os=linux sha256:d5a10aa5fcc7…error: could not compile `probe` (bin <str>) due to 1 previous errorrust/rustc · compiler-diagnostic · outer cargo check증거 품질: complete · 환경 변형: 1 · 최초 관측: 2026-09-19 · 마지막 관측: 2026-09-19
-
관측됨 PROJECT_COMPILE exit 101 ×1 0.1.12 os=linux sha256:e77b7f5807c8…error: could not compile `test-cc` (bin <str>) due to 3 previous errorsrust/rustc · compiler-diagnostic · outer cargo run증거 품질: complete · 환경 변형: 1 · 최초 관측: 2026-09-19 · 마지막 관측: 2026-09-19
-
관측됨 UNKNOWN exit 1 증거 공백 ×1 0.1.12 os=linux sha256:0a0adad89687…Compiling sample-cc v1.0.0 (<path> · Finished `dev` profile [unoptimized + debuginfo] target(s) in 0.16s · Running `target/debug/contract` …cargo · unclassified-diagnostic · outer cargo run · gap stage-unknown증거 품질: complete · 환경 변형: 1 · 최초 관측: 2026-09-19 · 마지막 관측: 2026-09-19진단 재검증 후보
-
관측됨 UNKNOWN exit 1 증거 공백 ×1 0.1.12 os=linux sha256:847e9223d6c8…Downloading crates ... · Downloaded cc v1.4.3 · Downloaded find-msvc-tools v0.1.12 · Downloaded shlex v2.0.1cargo · unclassified-diagnostic · outer cargo run · gap stage-unknown증거 품질: complete · 환경 변형: 1 · 최초 관측: 2026-09-19 · 마지막 관측: 2026-09-19진단 재검증 후보
-
관측됨 UNKNOWN exit 101 증거 공백 ×1 0.1.12 os=linux sha256:a3999c200a2d…Compiling sample-ring v1.0.0 (<path> · warning: unused import: `self` · --> test/contract.rs:<n>:<n> · |cargo · unclassified-diagnostic · outer cargo run · gap stage-unknown증거 품질: complete · 환경 변형: 1 · 최초 관측: 2026-09-19 · 마지막 관측: 2026-09-19진단 재검증 후보
-
관측됨 UNKNOWN exit 1 증거 공백 ×1 0.1.12 os=linux sha256:d1087cb5120a…Compiling sample-cc v1.0.0 (<path> · Finished `dev` profile [unoptimized + debuginfo] target(s) in 0.15s · Running `target/debug/contract` …cargo · unclassified-diagnostic · outer cargo run · gap stage-unknown증거 품질: complete · 환경 변형: 1 · 최초 관측: 2026-09-19 · 마지막 관측: 2026-09-19진단 재검증 후보
심벌
아직 증거가 있는 심벌이 없습니다.