Registroscargobumpalo3.20.3
Detalhe do ambiente
Observações no nível do projeto e verificações de símbolo/contrato são contadas separadamente e nunca somadas.
Estas contagens não distinguem como o símbolo foi chamado: sobrecargas, formatos de argumentos e opções são agrupados. O que uma forma de chamada específica faz é provado pelo contrato de uma amostra, não por estes números.
| Ambiente | Confiança | Observações | Verificado | Taxa de aprovação | Peers | Visto por último |
|---|---|---|---|---|---|---|
| unknown · Rust · cargo · linux glibc
Observações: PROJECT_COMPILE 6✓ 22✕ · PROJECT_PROCESS 45✓ · PROJECT_TEST 2✓ 3✕ — Verificado: UNKNOWN 0✓ 13✕
|
ELEVATED FAILURE | 78 | 13 | 58% | 1 | 2026-10-18 |
Clusters de falha recentes
-
observado PROJECT_COMPILE exit 101 E0433 ×8 3.20.3 os=linux sha256:8d7d824b0493…error[E0433]: cannot find module or crate `wasm_bindgen` in this scoperust/rustc · compiler-diagnostic · outer cargo checkQualidade da evidência: complete · Variantes de ambiente: 1 · Primeiro registro: 2026-09-19 · Visto por último: 2026-09-19
-
observado PROJECT_COMPILE exit 101 ×2 3.20.3 os=linux sha256:d0b315730521…error: could not compile `test-macro` (bin <str>) due to 1 previous errorrust/rustc · compiler-diagnostic · outer cargo checkQualidade da evidência: complete · Variantes de ambiente: 1 · Primeiro registro: 2026-09-19 · Visto por último: 2026-09-19
-
observado PROJECT_COMPILE exit 101 ×2 3.20.3 os=linux sha256:d5a10aa5fcc7…error: could not compile `probe` (bin <str>) due to 1 previous errorrust/rustc · compiler-diagnostic · outer cargo checkQualidade da evidência: complete · Variantes de ambiente: 1 · Primeiro registro: 2026-09-19 · Visto por último: 2026-09-19
-
observado PROJECT_TEST exit 101 ×2 3.20.3 os=linux sha256:3365a11bed28…error: test failed, to rerun pass `--lib` · running 4 tests · test tests::test_expand_enum ... ok · test tests::test_expand_function ... okrust/test · test-runner-diagnostic · outer cargo testQualidade da evidência: complete · Variantes de ambiente: 1 · Primeiro registro: 2026-09-19 · Visto por último: 2026-09-19
-
observado UNKNOWN exit 101 Lacuna de evidência ×2 3.20.3 os=linux sha256:8f78f52362b8…Updating crates.io index · Locking 7 packages to latest compatible versions · Adding wasm-bindgen-macro-support v0.2.128 (available: v0.2.129) …cargo · unclassified-diagnostic · outer cargo run · gap stage-unknownQualidade da evidência: complete · Variantes de ambiente: 1 · Primeiro registro: 2026-10-17 · Visto por último: 2026-10-17Candidato a reverificação diagnóstica
-
observado PROJECT_COMPILE exit 101 ×1 3.20.3 os=linux sha256:0788dc4c596e…error: could not compile `test_wb` (bin <str>) due to 1 previous errorrust/rustc · compiler-diagnostic · outer cargo checkQualidade da evidência: complete · Variantes de ambiente: 1 · Primeiro registro: 2026-09-19 · Visto por último: 2026-09-19
-
observado PROJECT_COMPILE exit 101 ×1 3.20.3 os=linux sha256:4d444e9e07b5…error: could not compile `test-wb` (bin <str>) due to 1 previous errorrust/rustc · compiler-diagnostic · outer cargo checkQualidade da evidência: complete · Variantes de ambiente: 1 · Primeiro registro: 2026-09-19 · Visto por último: 2026-09-19
-
observado PROJECT_COMPILE exit 101 ×1 3.20.3 os=linux sha256:52eb69f3e33a…error: could not compile `test_wasm` (bin <str>) due to 1 previous errorrust/rustc · compiler-diagnostic · outer cargo checkQualidade da evidência: complete · Variantes de ambiente: 1 · Primeiro registro: 2026-09-19 · Visto por último: 2026-09-19
-
observado PROJECT_COMPILE exit 101 ×1 3.20.3 os=linux sha256:5d2e00fc34f2…error: could not compile `test-macro` (bin <str>) due to 4 previous errorsrust/rustc · compiler-diagnostic · outer cargo checkQualidade da evidência: complete · Variantes de ambiente: 1 · Primeiro registro: 2026-09-19 · Visto por último: 2026-09-19
-
observado PROJECT_COMPILE exit 101 E0432 ×1 3.20.3 os=linux sha256:81ff5a6ae827…error[E0432]: unresolved import `wasm_bindgen_macro`rust/rustc · compiler-diagnostic · outer cargo checkQualidade da evidência: complete · Variantes de ambiente: 1 · Primeiro registro: 2026-09-19 · Visto por último: 2026-09-19
-
observado PROJECT_COMPILE exit 101 ×1 3.20.3 os=linux sha256:829cc11d4b55…error: could not compile `test_wb` (bin <str>) due to 4 previous errorsrust/rustc · compiler-diagnostic · outer cargo runQualidade da evidência: complete · Variantes de ambiente: 1 · Primeiro registro: 2026-09-19 · Visto por último: 2026-09-19
-
observado PROJECT_COMPILE exit 101 E0433 ×1 3.20.3 os=linux sha256:d6e85097541c…error[E0433]: cannot find `__wbindgen_coverage` in `wasm_bindgen`rust/rustc · compiler-diagnostic · outer cargo checkQualidade da evidência: complete · Variantes de ambiente: 1 · Primeiro registro: 2026-09-19 · Visto por último: 2026-09-19
Mostrando os 12 mais relatados de 27 grupos de falhas registrados. O resto são relatos únicos.
Símbolos
Ainda não há símbolos com evidências.