Relevéscargobumpalo3.20.3
Détail de l'environnement
Les observations au niveau projet et les vérifications de symbole/contrat sont comptées séparément et jamais additionnées.
Ces chiffres ne distinguent pas la façon dont le symbole a été appelé : surcharges, formes d'arguments et options sont regroupées. Ce que fait une forme d'appel précise est prouvé par le contrat d'un échantillon, pas par ces nombres.
| Environnement | Confiance | Observations | Vérifié | Taux de réussite | Pairs | Dernière observation |
|---|---|---|---|---|---|---|
| unknown · Rust · cargo · linux glibc
Observations: PROJECT_COMPILE 6✓ 22✕ · PROJECT_PROCESS 45✓ · PROJECT_TEST 2✓ 3✕ — Vérifié: UNKNOWN 0✓ 13✕
|
ELEVATED FAILURE | 78 | 13 | 58 % | 1 | 2026-10-18 |
Clusters d'échecs récents
-
observé PROJECT_COMPILE exit 101 E0433 ×8 3.20.3 os=linux sha256:8d7d824b0493…error[E0433]: cannot find module or crate `wasm_bindgen` in this scoperust/rustc · compiler-diagnostic · outer cargo checkQualité de preuve: complete · Variantes d’environnement: 1 · Premier relevé: 2026-09-19 · Dernière observation: 2026-09-19
-
observé PROJECT_COMPILE exit 101 ×2 3.20.3 os=linux sha256:d0b315730521…error: could not compile `test-macro` (bin <str>) due to 1 previous errorrust/rustc · compiler-diagnostic · outer cargo checkQualité de preuve: complete · Variantes d’environnement: 1 · Premier relevé: 2026-09-19 · Dernière observation: 2026-09-19
-
observé PROJECT_COMPILE exit 101 ×2 3.20.3 os=linux sha256:d5a10aa5fcc7…error: could not compile `probe` (bin <str>) due to 1 previous errorrust/rustc · compiler-diagnostic · outer cargo checkQualité de preuve: complete · Variantes d’environnement: 1 · Premier relevé: 2026-09-19 · Dernière observation: 2026-09-19
-
observé PROJECT_TEST exit 101 ×2 3.20.3 os=linux sha256:3365a11bed28…error: test failed, to rerun pass `--lib` · running 4 tests · test tests::test_expand_enum ... ok · test tests::test_expand_function ... okrust/test · test-runner-diagnostic · outer cargo testQualité de preuve: complete · Variantes d’environnement: 1 · Premier relevé: 2026-09-19 · Dernière observation: 2026-09-19
-
observé UNKNOWN exit 101 Lacune de preuve ×2 3.20.3 os=linux sha256:8f78f52362b8…Updating crates.io index · Locking 7 packages to latest compatible versions · Adding wasm-bindgen-macro-support v0.2.128 (available: v0.2.129) …cargo · unclassified-diagnostic · outer cargo run · gap stage-unknownQualité de preuve: complete · Variantes d’environnement: 1 · Premier relevé: 2026-10-17 · Dernière observation: 2026-10-17Candidat à une revérification diagnostique
-
observé PROJECT_COMPILE exit 101 ×1 3.20.3 os=linux sha256:0788dc4c596e…error: could not compile `test_wb` (bin <str>) due to 1 previous errorrust/rustc · compiler-diagnostic · outer cargo checkQualité de preuve: complete · Variantes d’environnement: 1 · Premier relevé: 2026-09-19 · Dernière observation: 2026-09-19
-
observé PROJECT_COMPILE exit 101 ×1 3.20.3 os=linux sha256:4d444e9e07b5…error: could not compile `test-wb` (bin <str>) due to 1 previous errorrust/rustc · compiler-diagnostic · outer cargo checkQualité de preuve: complete · Variantes d’environnement: 1 · Premier relevé: 2026-09-19 · Dernière observation: 2026-09-19
-
observé PROJECT_COMPILE exit 101 ×1 3.20.3 os=linux sha256:52eb69f3e33a…error: could not compile `test_wasm` (bin <str>) due to 1 previous errorrust/rustc · compiler-diagnostic · outer cargo checkQualité de preuve: complete · Variantes d’environnement: 1 · Premier relevé: 2026-09-19 · Dernière observation: 2026-09-19
-
observé PROJECT_COMPILE exit 101 ×1 3.20.3 os=linux sha256:5d2e00fc34f2…error: could not compile `test-macro` (bin <str>) due to 4 previous errorsrust/rustc · compiler-diagnostic · outer cargo checkQualité de preuve: complete · Variantes d’environnement: 1 · Premier relevé: 2026-09-19 · Dernière observation: 2026-09-19
-
observé PROJECT_COMPILE exit 101 E0432 ×1 3.20.3 os=linux sha256:81ff5a6ae827…error[E0432]: unresolved import `wasm_bindgen_macro`rust/rustc · compiler-diagnostic · outer cargo checkQualité de preuve: complete · Variantes d’environnement: 1 · Premier relevé: 2026-09-19 · Dernière observation: 2026-09-19
-
observé PROJECT_COMPILE exit 101 ×1 3.20.3 os=linux sha256:829cc11d4b55…error: could not compile `test_wb` (bin <str>) due to 4 previous errorsrust/rustc · compiler-diagnostic · outer cargo runQualité de preuve: complete · Variantes d’environnement: 1 · Premier relevé: 2026-09-19 · Dernière observation: 2026-09-19
-
observé PROJECT_COMPILE exit 101 E0433 ×1 3.20.3 os=linux sha256:d6e85097541c…error[E0433]: cannot find `__wbindgen_coverage` in `wasm_bindgen`rust/rustc · compiler-diagnostic · outer cargo checkQualité de preuve: complete · Variantes d’environnement: 1 · Premier relevé: 2026-09-19 · Dernière observation: 2026-09-19
Affichage des 12 plus signalés parmi 27 groupes d’échecs enregistrés. Le reste sont des signalements uniques.
Symboles
Pas encore de symboles avec des preuves.