记录npmws8.21.3WebSocket
更改条件
依赖健康度
某次解析读取了该版本的依赖树,没有发现依赖。这是一次测量结果,而不是缺失。
近期失败聚类
-
已观测 PROJECT_PROCESS ERR_ASSERTION 证据缺口 ×17 8.21.3 executionContext=node证据质量: legacy-evidence-incomplete · 环境变体: 3 · 首次记录: 2026-08-18 · 最近观测: 2026-08-27诊断复验候选
-
已观测 UNKNOWN exit 1 ERR_ASSERTION 证据缺口 ×2 8.21.3 executionContext=node · moduleSystem=cjs · os=linux · runtime=node@22.23 sha256:deb29d18a641…Test failed: AssertionError [ERR_ASSERTION]: Expected values to be strictly equal: · + actual - expected · + <str> · - <str>node · unclassified-diagnostic · outer node · gap stage-unknown证据质量: complete · 环境变体: 1 · 首次记录: 2026-08-29 · 最近观测: 2026-08-29诊断复验候选
-
已观测 UNKNOWN exit 1 证据缺口 ×2 8.21.3 executionContext=node · moduleSystem=cjs · os=linux · runtime=node@22.23 sha256:91ad26545eb1…node:internal/modules/cjs/loader:<n> · throw err; · ^ · Error: Cannot find module <str>node · unclassified-diagnostic · outer node · gap stage-unknown证据质量: complete · 环境变体: 1 · 首次记录: 2026-08-31 · 最近观测: 2026-08-31诊断复验候选
-
已观测 UNKNOWN exit 1 ERR_ASSERTION 证据缺口 ×2 8.21.3 executionContext=node · moduleSystem=esm · os=linux · runtime=node@22.23 sha256:986d98189e70…node:internal/modules/run_main:<n> · triggerUncaughtException( · ^ · AssertionError [ERR_ASSERTION]: Expected values to be strictly equal:node · unclassified-diagnostic · outer node · gap stage-unknown证据质量: complete · 环境变体: 1 · 首次记录: 2026-08-31 · 最近观测: 2026-08-31诊断复验候选
-
已观测 UNKNOWN exit 1 ERR_ASSERTION 证据缺口 ×1 8.21.3 executionContext=node · moduleSystem=cjs · os=linux · runtime=node@22.23 sha256:3ad0f21f8b08…Contract test failed: AssertionError [ERR_ASSERTION]: Expected values to be strictly equal: · + actual - expected · + <str> · - <str>node · unclassified-diagnostic · outer node · gap stage-unknown证据质量: complete · 环境变体: 1 · 首次记录: 2026-08-29 · 最近观测: 2026-08-29诊断复验候选
-
已观测 UNKNOWN exit 1 ERR_ASSERTION 证据缺口 ×1 8.21.3 executionContext=node · moduleSystem=esm · os=linux · runtime=node@22.23 sha256:c38a78d344c3…Contract verification failed: AssertionError [ERR_ASSERTION]: Expected values to be strictly equal: · + actual - expected · + [Function: createRoot$1] …node · unclassified-diagnostic · outer node · gap stage-unknown证据质量: complete · 环境变体: 1 · 首次记录: 2026-08-31 · 最近观测: 2026-08-31诊断复验候选
-
已观测 UNKNOWN exit 13 证据缺口 ×1 8.21.3 executionContext=node · moduleSystem=esm · os=linux · runtime=node@22.23 sha256:039a342da574…Warning: Detected unsettled top-level await at <url> · await new Promise((resolve) => { · ^ · Testing JSDOM ResourceLoader capabilities...node · unclassified-diagnostic · outer node · gap stage-unknown证据质量: complete · 环境变体: 1 · 首次记录: 2026-08-31 · 最近观测: 2026-08-31诊断复验候选
-
已观测 UNKNOWN exit 1 ERR_ASSERTION 证据缺口 ×1 8.21.3 executionContext=node · moduleSystem=esm · os=linux · runtime=node@22.23 sha256:0aab47d72aec…node:internal/modules/run_main:<n> · triggerUncaughtException( · ^ …node · unclassified-diagnostic · outer node · gap stage-unknown证据质量: complete · 环境变体: 1 · 首次记录: 2026-08-31 · 最近观测: 2026-08-31诊断复验候选
-
已观测 UNKNOWN exit 13 证据缺口 ×1 8.21.3 executionContext=node · moduleSystem=esm · os=linux · runtime=node@22.23 sha256:e05fc6863dbb…Warning: Detected unsettled top-level await at <url> · await new Promise((resolve) => { · ^ · Testing full ResourceLoader contract suite...node · unclassified-diagnostic · outer node · gap stage-unknown证据质量: complete · 环境变体: 1 · 首次记录: 2026-08-31 · 最近观测: 2026-08-31诊断复验候选
-
已观测 UNKNOWN exit 1 ERR_ASSERTION 证据缺口 ×1 8.21.3 executionContext=node · moduleSystem=esm · os=linux · runtime=node@22.23 sha256:e6dc9227296b…node:internal/modules/run_main:<n> · triggerUncaughtException( · ^ · AssertionError [ERR_ASSERTION]: Values have same structure but are not reference-equal:node · unclassified-diagnostic · outer node · gap stage-unknown证据质量: complete · 环境变体: 1 · 首次记录: 2026-08-31 · 最近观测: 2026-08-31诊断复验候选
-
已观测 UNKNOWN exit 1 证据缺口 ×1 8.21.3 executionContext=node · moduleSystem=esm · os=linux · runtime=node@22.23 sha256:529aac3b1da7…<url> · globalThis.navigator = dom.window.navigator; · ^ · TypeError: Cannot set property navigator of #<Object> which has only a getternode · unclassified-diagnostic · outer node · gap stage-unknown证据质量: complete · 环境变体: 1 · 首次记录: 2026-09-12 · 最近观测: 2026-09-12诊断复验候选