Recordsnpmwrappy1.0.2
Change the conditions
Current conditions
wrappy @1.0.2ubuntu glibc · x64 · node 22 · npm 10 · node
package-level total, not an API
0 of 84 passed
Verified — this network ran a contract at this coordinate.
there is a sample here, and our run of it at this coordinate failed (1)
- Project observations
- 226 / 233
- Contract verifications
- 0 / 84
- Usage records
- 142
- Independent reporting peers
- 3
- Failures with a captured fingerprint
- 0 / 7
- Last recorded
- 2026-09-14
Evidence you can open
Dependency Health
A resolution read this release's tree and found no dependencies. That is a measurement, not a missing one.
Recent failure clusters
-
observed PROJECT_PROCESS ERR_ASSERTION Evidence gap ×23 1.0.2 executionContext=nodeEvidence quality: legacy-evidence-incomplete · Environment variants: 3 · First recorded: 2026-08-13 · Last seen: 2026-08-29Diagnostic re-verification candidate
-
observed UNKNOWN exit 1 Evidence gap ×16 1.0.2 executionContext=node · moduleSystem=cjs · os=linux · runtime=node@22.23 sha256:9be950af9140…Traceback (most recent call last): · File <str>, line 1, in <module> · ModuleNotFoundError: No module named <str>python3 · unclassified-diagnostic · outer python3 · gap stage-unknownEvidence quality: complete · Environment variants: 1 · First recorded: 2026-08-30 · Last seen: 2026-08-31Diagnostic re-verification candidate
-
observed PROCESS_START process start failed Evidence gap ×8 1.0.2 executionContext=node sha256:c12549970456…· structured-termination · gap diagnostic-missingEvidence quality: partial · Environment variants: 3 · First recorded: 2026-08-30 · Last seen: 2026-09-17Diagnostic re-verification candidate
-
observed UNKNOWN exit 1 Evidence gap ×7 1.0.2 executionContext=node · moduleSystem=cjs · os=linux · runtime=node@22.23 sha256:91ad26545eb1…node:internal/modules/cjs/loader:<n> · throw err; · ^ · Error: Cannot find module <str>node · unclassified-diagnostic · outer node · gap stage-unknownEvidence quality: complete · Environment variants: 1 · First recorded: 2026-08-30 · Last seen: 2026-09-05Diagnostic re-verification candidate
-
observed UNKNOWN exit 1 ERR_ASSERTION Evidence gap ×7 1.0.2 executionContext=node · os=linux · runtime=node@22.23 sha256:986d98189e70…node:internal/modules/run_main:<n> · triggerUncaughtException( · ^ · AssertionError [ERR_ASSERTION]: Expected values to be strictly equal:node · unclassified-diagnostic · outer node · gap stage-unknownEvidence quality: complete · Environment variants: 2 · First recorded: 2026-08-30 · Last seen: 2026-09-05Diagnostic re-verification candidate
-
observed UNKNOWN exit 2 Evidence gap ×4 1.0.2 executionContext=node · moduleSystem=cjs · os=linux · runtime=node@22.23 sha256:fddf8ea09045…Using CPython 3.12.3 interpreter at: <path> · Creating virtual environment at: .venv · error: Failed to create virtual environment …· unclassified-diagnostic · gap stage-unknownEvidence quality: complete · Environment variants: 1 · First recorded: 2026-08-30 · Last seen: 2026-08-31Diagnostic re-verification candidate
-
observed UNKNOWN exit 1 Evidence gap ×4 1.0.2 executionContext=node · moduleSystem=cjs · os=linux · runtime=node@22.23 sha256:72ba2d1e946f…<path>: No module named pippython3 · unclassified-diagnostic · outer python3 · gap stage-unknownEvidence quality: complete · Environment variants: 1 · First recorded: 2026-08-31 · Last seen: 2026-08-31Diagnostic re-verification candidate
-
observed UNKNOWN exit 1 ERR_ASSERTION Evidence gap ×3 1.0.2 executionContext=node · moduleSystem=cjs · os=linux · runtime=node@22.23 sha256:3fef3a519082…Contract test failure: AssertionError [ERR_ASSERTION]: Expected values to be strictly equal: · + actual - expected · + <str> · - <str>node · unclassified-diagnostic · outer node · gap stage-unknownEvidence quality: complete · Environment variants: 1 · First recorded: 2026-08-31 · Last seen: 2026-08-31Diagnostic re-verification candidate
-
observed UNKNOWN exit 1 Evidence gap ×2 1.0.2 executionContext=node · moduleSystem=cjs · os=linux · runtime=node@22.23 sha256:8310a83be884…node:internal/modules/cjs/loader:<n> · const err = new Error(message); · ^ · Error: Cannot find module <str>node · unclassified-diagnostic · outer node · gap stage-unknownEvidence quality: complete · Environment variants: 1 · First recorded: 2026-09-04 · Last seen: 2026-09-04Diagnostic re-verification candidate
-
observed UNKNOWN exit 1 Evidence gap ×1 1.0.2 executionContext=node · moduleSystem=cjs · os=linux · runtime=node@22.23 sha256:6370f8688b49…Contract test failed: Error: Cannot find module <str> · Require stack: · - <path> · - <path>node · unclassified-diagnostic · outer node · gap stage-unknownEvidence quality: complete · Environment variants: 1 · First recorded: 2026-08-29 · Last seen: 2026-08-29Diagnostic re-verification candidate
-
observed UNKNOWN exit 1 ERR_ASSERTION Evidence gap ×1 1.0.2 executionContext=node · moduleSystem=cjs · os=linux · runtime=node@22.23 sha256:f326878dcad5…AssertionError [ERR_ASSERTION]: App declaration must contain <str> method · at runTests (<path>:<n>:<n>) · at Object.<anonymous> (<path>:<n>:<n>) …node · unclassified-diagnostic · outer node · gap stage-unknownEvidence quality: complete · Environment variants: 1 · First recorded: 2026-08-29 · Last seen: 2026-08-29Diagnostic re-verification candidate
-
observed UNKNOWN exit 1 Evidence gap ×1 1.0.2 executionContext=node · moduleSystem=esm · os=linux · runtime=node@22.23 sha256:795cbb5ee086…Error: Cannot find module <str> · Require stack: · - <path> · - <path>node · unclassified-diagnostic · outer node · gap stage-unknownEvidence quality: complete · Environment variants: 1 · First recorded: 2026-08-30 · Last seen: 2026-08-30Diagnostic re-verification candidate
Showing the 12 most-reported of 45 recorded failure clusters. The rest are single reports.