Recordsnpmwrap-ansi6.2.0
Change the conditions
Current conditions
wrap-ansi @6.2.0ubuntu glibc · x64 · node 22 · npm 10 · node
package-level total, not an API
0 of 5 passed
Verified — this network ran a contract at this coordinate.
there is a sample here, and our run of it at this coordinate failed (1)
- Project observations
- 26 / 26
- Contract verifications
- 0 / 5
- Usage records
- 1
- Independent reporting peers
- 1
- Last recorded
- 2026-09-17
Dependency Health
Observed combinations and failure evidence for this release
First observed break
6.2.0
linux · node@22.23 · moduleSystem=esm · executionContext=node
1 FAIL
· stage: UNKNOWN
· fingerprint: sha256:4a939d00eec492b9a03b26b042fb8a8194c85e6b0782361ef967eb9b259f03ba
| Library | Version | Health | Measured there | Projects |
|---|---|---|---|---|
| ansi-styles | 4.3.0 | CANDIDATE Correlated change; unproven combination | contract passed | 23 project-days |
| string-width | 4.2.3 | CANDIDATE Correlated change; unproven combination | contract passed | 23 project-days |
| strip-ansi | 6.0.1 | CANDIDATE Correlated change; unproven combination | contract passed | 23 project-days |
The measured column is about each dependency's own release, not about the pair. A resolver placing two releases side by side is not evidence that they work together.
Dependency versions across releases
What each release of this package resolved its children to. A child whose version moved is listed first: that is where an upgrade changed something underneath you.
| Library | 9.0.2 | 8.1.0 | 7.0.0 | 6.2.0 |
|---|---|---|---|---|
| ansi-styles | 6.2.3 | 6.2.3 | 4.3.0 | 4.3.0 |
| string-width | 7.2.0 | 5.1.2 | 4.2.3 | 4.2.3 |
| strip-ansi | 7.2.0 | 7.1.2 | 6.0.1 | 6.0.1 |
Moved: 3 · unchanged at every release: 0
An edge records that a resolver placed one release beside another on a real machine. It is not a claim that the two work together; that question is answered by samples and contracts, not by presence here.
Recent failure clusters
-
observed UNKNOWN exit 13 Evidence gap ×1 6.2.0 executionContext=node · moduleSystem=esm · os=linux · runtime=node@22.23 sha256:4a939d00eec4…Warning: Detected unsettled top-level await at <url>]:<n> · const ans = await promptPromise; · ^ · fil<path>:<n>node · unclassified-diagnostic · outer node · gap stage-unknownEvidence quality: complete · Environment variants: 1 · First recorded: 2026-09-16 · Last seen: 2026-09-16Diagnostic re-verification candidate
-
observed UNKNOWN exit 1 ERR_ASSERTION Evidence gap ×1 6.2.0 executionContext=node · moduleSystem=cjs · os=linux · runtime=node@22.23 sha256:b12460008ca6…Test failed: AssertionError [ERR_ASSERTION]: Expected values to be strictly equal: · true !== false · at runTests (<url>) · at <url>node · unclassified-diagnostic · outer node · gap stage-unknownEvidence quality: complete · Environment variants: 1 · First recorded: 2026-09-16 · Last seen: 2026-09-16Diagnostic re-verification candidate
-
observed UNKNOWN exit 1 Evidence gap ×1 6.2.0 executionContext=node · moduleSystem=cjs · os=linux · runtime=node@22.23 sha256:c0573fd829b8…<url> · import confirm, { promptConfirm } from <str>; · ^^^^^^^ · SyntaxError: The requested module <str> does not provide an export named <str>node · unclassified-diagnostic · outer node · gap stage-unknownEvidence quality: complete · Environment variants: 1 · First recorded: 2026-09-16 · Last seen: 2026-09-16Diagnostic re-verification candidate
-
observed UNKNOWN exit 1 ERR_ASSERTION Evidence gap ×1 6.2.0 executionContext=node · moduleSystem=cjs · os=linux · runtime=node@22.23 sha256:deb29d18a641…Test failed: AssertionError [ERR_ASSERTION]: Expected values to be strictly equal: · + actual - expected · + <str> · - <str>node · unclassified-diagnostic · outer node · gap stage-unknownEvidence quality: complete · Environment variants: 1 · First recorded: 2026-09-16 · Last seen: 2026-09-16Diagnostic re-verification candidate
-
observed UNKNOWN exit 1 ERR_ASSERTION Evidence gap ×1 6.2.0 executionContext=node · moduleSystem=esm · os=linux · runtime=node@22.23 sha256:eff444dbb236…Contract test failure: AssertionError [ERR_ASSERTION]: Plain object should not be identified as Separator · true !== false · at testSeparator (<url>) …node · unclassified-diagnostic · outer node · gap stage-unknownEvidence quality: complete · Environment variants: 1 · First recorded: 2026-09-16 · Last seen: 2026-09-16Diagnostic re-verification candidate