Registrosnpmwrap-ansi6.2.0wrapAnsi
Cambiar las condiciones
Condiciones actuales
wrapAnsi @6.2.0debian glibc · x64 · node 22 · npm · node
1 de 1 pasaron
Verificado: esta red ejecutó un contrato en esta coordenada.
hay una muestra aquí y nuestra ejecución en esta coordenada terminó limpia (1)
- Observaciones de proyectos
- 2 / 2
- Verificaciones de contrato
- 1 / 1
- Peers independientes que reportaron
- 1
- Último registro
- 2026-09-17
Salud de dependencias
Combinaciones observadas y evidencia de fallos para esta versión
Primer fallo observado
6.2.0
linux · node@22.23 · moduleSystem=esm · executionContext=node
1 FAIL
· stage: UNKNOWN
· fingerprint: sha256:4a939d00eec492b9a03b26b042fb8a8194c85e6b0782361ef967eb9b259f03ba
| Biblioteca | Versión | Estado | Medido allí | Proyectos |
|---|---|---|---|---|
| ansi-styles | 4.3.0 | CANDIDATE Cambio correlacionado; combinación no probada | contrato aprobado | 23 días-proyecto |
| string-width | 4.2.3 | CANDIDATE Cambio correlacionado; combinación no probada | contrato aprobado | 23 días-proyecto |
| strip-ansi | 6.0.1 | CANDIDATE Cambio correlacionado; combinación no probada | contrato aprobado | 23 días-proyecto |
La columna de medición se refiere a la versión de cada dependencia en sí, no al par. Que un resolutor haya colocado dos versiones juntas no prueba que funcionen juntas.
Versiones de dependencias por versión
A qué resolvió sus hijos cada versión de este paquete. Primero va el hijo cuya versión se movió: ahí una actualización cambió algo bajo tus pies.
| Biblioteca | 9.0.2 | 8.1.0 | 7.0.0 | 6.2.0 |
|---|---|---|---|---|
| ansi-styles | 6.2.3 | 6.2.3 | 4.3.0 | 4.3.0 |
| string-width | 7.2.0 | 5.1.2 | 4.2.3 | 4.2.3 |
| strip-ansi | 7.2.0 | 7.1.2 | 6.0.1 | 6.0.1 |
Se movieron: 3 · iguales en todas las versiones: 0
Una arista registra que un resolutor colocó una versión junto a otra en una máquina real. No afirma que ambas funcionen juntas; a esa pregunta responden las muestras y los contratos, no la presencia de una fila.
Clústeres de fallos recientes
-
observado UNKNOWN exit 13 Brecha de evidencia ×1 6.2.0 executionContext=node · moduleSystem=esm · os=linux · runtime=node@22.23 sha256:4a939d00eec4…Warning: Detected unsettled top-level await at <url>]:<n> · const ans = await promptPromise; · ^ · fil<path>:<n>node · unclassified-diagnostic · outer node · gap stage-unknownCalidad de evidencia: complete · Variantes de entorno: 1 · Primer registro: 2026-09-16 · Última observación: 2026-09-16Candidato a reverificación diagnóstica
-
observado UNKNOWN exit 1 ERR_ASSERTION Brecha de evidencia ×1 6.2.0 executionContext=node · moduleSystem=cjs · os=linux · runtime=node@22.23 sha256:b12460008ca6…Test failed: AssertionError [ERR_ASSERTION]: Expected values to be strictly equal: · true !== false · at runTests (<url>) · at <url>node · unclassified-diagnostic · outer node · gap stage-unknownCalidad de evidencia: complete · Variantes de entorno: 1 · Primer registro: 2026-09-16 · Última observación: 2026-09-16Candidato a reverificación diagnóstica
-
observado UNKNOWN exit 1 Brecha de evidencia ×1 6.2.0 executionContext=node · moduleSystem=cjs · os=linux · runtime=node@22.23 sha256:c0573fd829b8…<url> · import confirm, { promptConfirm } from <str>; · ^^^^^^^ · SyntaxError: The requested module <str> does not provide an export named <str>node · unclassified-diagnostic · outer node · gap stage-unknownCalidad de evidencia: complete · Variantes de entorno: 1 · Primer registro: 2026-09-16 · Última observación: 2026-09-16Candidato a reverificación diagnóstica
-
observado UNKNOWN exit 1 ERR_ASSERTION Brecha de evidencia ×1 6.2.0 executionContext=node · moduleSystem=cjs · os=linux · runtime=node@22.23 sha256:deb29d18a641…Test failed: AssertionError [ERR_ASSERTION]: Expected values to be strictly equal: · + actual - expected · + <str> · - <str>node · unclassified-diagnostic · outer node · gap stage-unknownCalidad de evidencia: complete · Variantes de entorno: 1 · Primer registro: 2026-09-16 · Última observación: 2026-09-16Candidato a reverificación diagnóstica
-
observado UNKNOWN exit 1 ERR_ASSERTION Brecha de evidencia ×1 6.2.0 executionContext=node · moduleSystem=esm · os=linux · runtime=node@22.23 sha256:eff444dbb236…Contract test failure: AssertionError [ERR_ASSERTION]: Plain object should not be identified as Separator · true !== false · at testSeparator (<url>) …node · unclassified-diagnostic · outer node · gap stage-unknownCalidad de evidencia: complete · Variantes de entorno: 1 · Primer registro: 2026-09-16 · Última observación: 2026-09-16Candidato a reverificación diagnóstica