Registrosnpmvite8.2.2
Mudar as condições
Condições atuais
vite @8.2.2ubuntu glibc · x64 · node 22 · npm 10 · node
total do pacote, não uma API
0 de 9 passaram
Verificado — esta rede executou um contrato nesta coordenada.
há uma amostra aqui e nossa execução nesta coordenada falhou
- Observações de projetos
- 44 / 45
- Verificações de contrato
- 0 / 9
- Registros de uso
- 1
- Peers independentes que reportaram
- 1
- Último registro
- 2026-09-04
Saúde das dependências
Combinações observadas e evidências de falha para esta versão
Primeira quebra observada
8.2.2
linux · node@22.23 · executionContext=node
4 FAIL
· stage: UNKNOWN
· fingerprint: sha256:986d98189e70ab6bb81e3ca5f5feb96281ba0dfa6e522caa6ddd3d9b148578cc
| Biblioteca | Versão | Saúde | Medido ali | Projetos |
|---|---|---|---|---|
| picomatch | 4.0.7 | CANDIDATE Mudança correlacionada; combinação não comprovada | contrato aprovado | 5 dias-projeto |
| postcss | 8.5.26 | CANDIDATE Mudança correlacionada; combinação não comprovada | contrato aprovado | 4 dias-projeto |
| postcss | 8.5.28 | CANDIDATE Mudança correlacionada; combinação não comprovada | contrato aprovado | 1 dia-projeto |
| rolldown | 1.2.6 | CANDIDATE Mudança correlacionada; combinação não comprovada | contrato aprovado | 3 dias-projeto |
| rolldown | 1.2.7 | CANDIDATE Mudança correlacionada; combinação não comprovada | contrato aprovado | 1 dia-projeto |
| tinyglobby | 0.2.17 | CANDIDATE Mudança correlacionada; combinação não comprovada | contrato aprovado | 4 dias-projeto |
| lightningcss | 1.33.0 | PASS Todas as observações passaram | contrato aprovado | 5 dias-projeto |
A coluna de medição é sobre a versão de cada dependência em si, não sobre o par. Um resolvedor ter colocado duas versões lado a lado não é prova de que funcionam juntas.
Versões de dependências por versão
Para que cada versão deste pacote resolveu seus filhos. O filho cuja versão se moveu vem primeiro: foi ali que uma atualização mudou algo sob os seus pés.
| Biblioteca | 8.3.0 | 8.2.2 | 8.2.1 | 7.3.6 | 7.3.1 | 6.4.3 | 6.2.0 | 5.4.21 | 5.4.14 |
|---|---|---|---|---|---|---|---|---|---|
| esbuild | — | — | — | 0.28.2 | 0.27.2 | 0.25.12 | 0.25.12 | 0.21.5 | 0.21.5 |
| picomatch | 4.0.7 | 4.0.7 | 4.0.5 | 4.0.5 | 4.0.3 | 4.0.5 | — | — | — |
| postcss | 8.5.28 | 8.5.28 | 8.5.26 | 8.5.26 | 8.5.6 | 8.5.26 | 8.5.28 | 8.5.25 | 8.5.28 |
| rolldown | 1.2.8 | 1.2.7 | 1.2.4 | — | — | — | — | — | — |
| rollup | — | — | — | 4.63.3 | 4.54.0 | 4.63.3 | 4.62.4 | 4.62.3 | 4.63.1 |
| tinyglobby | 0.2.17 | 0.2.17 | 0.2.17 | 0.2.17 | 0.2.15 | 0.2.17 | — | — | — |
| fdir | — | — | — | 6.5.0 | 6.5.0 | 6.5.0 | — | — | — |
| lightningcss | 1.33.0 | 1.33.0 | 1.33.0 | — | — | — | — | — | — |
| vitest | — | — | 4.1.10 | — | — | — | — | — | — |
Moveram-se: 6 · iguais em todas as versões: 3
Uma aresta registra que um resolvedor colocou uma versão ao lado de outra em uma máquina real. Não é uma afirmação de que as duas funcionam juntas; essa pergunta é respondida por amostras e contratos, não pela presença de uma linha.
Clusters de falha recentes
-
observado UNKNOWN exit 1 ERR_ASSERTION Lacuna de evidência ×4 6.4.3 → 8.2.2 executionContext=node · os=linux · runtime=node@22.23 sha256:986d98189e70…node:internal/modules/run_main:<n> · triggerUncaughtException( · ^ · AssertionError [ERR_ASSERTION]: Expected values to be strictly equal:node · unclassified-diagnostic · outer node · gap stage-unknownQualidade da evidência: complete · Variantes de ambiente: 2 · Primeiro registro: 2026-09-04 · Visto por último: 2026-09-05Candidato a reverificação diagnóstica
-
observado PROJECT_TEST exit 1 ERR_LOAD_URL ×1 8.2.2 executionContext=node · moduleSystem=esm · os=linux · runtime=node@22.23 sha256:a60e7101af87…Contract test failed: Error: Failed to load custom Reporter from basic · at loadCustomReporterModule (fil<path>:<n>:<n>) · at fil<path>:<n>:<n> …javascript/test-runner · test-runner-diagnostic · outer npm testQualidade da evidência: complete · Variantes de ambiente: 1 · Primeiro registro: 2026-08-31 · Visto por último: 2026-08-31
-
observado UNKNOWN exit 1 Lacuna de evidência ×1 8.2.2 executionContext=node · moduleSystem=esm · os=linux · runtime=node@22.23 sha256:0ce61af3f1a8…<url>]:<n> · const res = await babelPlugin.transform.handler(code, <str>); · ^ · TypeError: Cannot read properties of undefined (reading <str>)node · unclassified-diagnostic · outer node · gap stage-unknownQualidade da evidência: complete · Variantes de ambiente: 1 · Primeiro registro: 2026-09-01 · Visto por último: 2026-09-01Candidato a reverificação diagnóstica
-
observado UNKNOWN exit 1 Lacuna de evidência ×1 8.2.2 executionContext=node · moduleSystem=esm · os=linux · runtime=node@22.23 sha256:249ecd4b894f…fil<path>:<n> · skipFastRefresh = isProduction || config.command === <str> || config.server.hmr === false; · ^ …node · unclassified-diagnostic · outer node · gap stage-unknownQualidade da evidência: complete · Variantes de ambiente: 1 · Primeiro registro: 2026-09-01 · Visto por último: 2026-09-01Candidato a reverificação diagnóstica
-
observado UNKNOWN exit 1 Lacuna de evidência ×1 8.2.2 executionContext=node · moduleSystem=esm · os=linux · runtime=node@22.23 sha256:8a6df6b44383…fil<path>:<n> · if (config.experimental.bundledDev) isBundledDev = true; · ^ · TypeError: Cannot read properties of undefined (reading <str>)node · unclassified-diagnostic · outer node · gap stage-unknownQualidade da evidência: complete · Variantes de ambiente: 1 · Primeiro registro: 2026-09-01 · Visto por último: 2026-09-01Candidato a reverificação diagnóstica
-
observado UNKNOWN exit 1 ERR_ASSERTION Lacuna de evidência ×1 8.2.2 executionContext=node · moduleSystem=esm · os=linux · runtime=node@22.23 sha256:8b0e67a45c04…node:internal/modules/run_main:<n> · triggerUncaughtException( · ^ · AssertionError [ERR_ASSERTION]: resolves <path> to virtual module IDnode · unclassified-diagnostic · outer node · gap stage-unknownQualidade da evidência: complete · Variantes de ambiente: 1 · Primeiro registro: 2026-09-01 · Visto por último: 2026-09-01Candidato a reverificação diagnóstica
-
observado UNKNOWN exit 1 ERR_ASSERTION Lacuna de evidência ×1 8.2.2 executionContext=node · moduleSystem=esm · os=linux · runtime=node@22.23 sha256:9088da2c451a…node:internal/modules/run_main:<n> · triggerUncaughtException( · ^ · AssertionError [ERR_ASSERTION]: load code contains RefreshRuntimenode · unclassified-diagnostic · outer node · gap stage-unknownQualidade da evidência: complete · Variantes de ambiente: 1 · Primeiro registro: 2026-09-01 · Visto por último: 2026-09-01Candidato a reverificação diagnóstica
-
observado UNKNOWN exit 1 Lacuna de evidência ×1 8.2.2 executionContext=node · moduleSystem=esm · os=linux · runtime=node@22.23 sha256:aaa882de0091…fil<path>:<n> · const hooks = config.plugins.map((plugin) => plugin.api?.reactBabel).filter(defined); · ^ …node · unclassified-diagnostic · outer node · gap stage-unknownQualidade da evidência: complete · Variantes de ambiente: 1 · Primeiro registro: 2026-09-01 · Visto por último: 2026-09-01Candidato a reverificação diagnóstica
-
observado UNKNOWN exit 1 ERR_PACKAGE_PATH_NOT_EXPORTED Lacuna de evidência ×1 8.2.2 executionContext=node · moduleSystem=esm · os=linux · runtime=node@22.23 sha256:b9a7518ba7bb…node:internal/modules/esm/resolve:<n> · return new ERR_PACKAGE_PATH_NOT_EXPORTED( · ^ …node · unclassified-diagnostic · outer node · gap stage-unknownQualidade da evidência: complete · Variantes de ambiente: 1 · Primeiro registro: 2026-09-01 · Visto por último: 2026-09-01Candidato a reverificação diagnóstica
-
observado UNKNOWN exit 1 ERR_PACKAGE_PATH_NOT_EXPORTED Lacuna de evidência ×1 8.2.2 executionContext=node · moduleSystem=cjs · os=linux · runtime=node@22.23 sha256:e72340c7e3d4…node:internal/modules/cjs/loader:<n> · throw e; · ^ · Error [ERR_PACKAGE_PATH_NOT_EXPORTED]: Package subpath <str> is not defined by <str> in <path>node · unclassified-diagnostic · outer node · gap stage-unknownQualidade da evidência: complete · Variantes de ambiente: 1 · Primeiro registro: 2026-09-04 · Visto por último: 2026-09-04Candidato a reverificação diagnóstica