Recordsnpmvite8.2.2
Change the conditions
Current conditions
vite @8.2.2debian glibc · x64 · node 22 · npm · node
package-level total, not an API
Recorded as present in projects. Nothing was run at this coordinate.
Observed — real project builds reported from this coordinate.
no sample at this coordinate yet
- Project observations
- nothing at this coordinate
- Contract verifications
- nothing at this coordinate
- Usage records
- 1
- Independent reporting peers
- 1
- Last recorded
- 2026-09-01
Dependency Health
Observed combinations and failure evidence for this release
First observed break
8.2.2
linux · node@22.23 · executionContext=node
4 FAIL
· stage: UNKNOWN
· fingerprint: sha256:986d98189e70ab6bb81e3ca5f5feb96281ba0dfa6e522caa6ddd3d9b148578cc
| Library | Version | Health | Measured there | Projects |
|---|---|---|---|---|
| picomatch | 4.0.7 | CANDIDATE Correlated change; unproven combination | contract passed | 5 project-days |
| postcss | 8.5.26 | CANDIDATE Correlated change; unproven combination | contract passed | 4 project-days |
| postcss | 8.5.28 | CANDIDATE Correlated change; unproven combination | contract passed | 1 project-day |
| rolldown | 1.2.6 | CANDIDATE Correlated change; unproven combination | contract passed | 3 project-days |
| rolldown | 1.2.7 | CANDIDATE Correlated change; unproven combination | contract passed | 1 project-day |
| tinyglobby | 0.2.17 | CANDIDATE Correlated change; unproven combination | contract passed | 4 project-days |
| lightningcss | 1.33.0 | PASS All observations passed | contract passed | 5 project-days |
The measured column is about each dependency's own release, not about the pair. A resolver placing two releases side by side is not evidence that they work together.
Dependency versions across releases
What each release of this package resolved its children to. A child whose version moved is listed first: that is where an upgrade changed something underneath you.
| Library | 8.3.0 | 8.2.2 | 8.2.1 | 7.3.6 | 7.3.1 | 6.4.3 | 6.2.0 | 5.4.21 | 5.4.14 |
|---|---|---|---|---|---|---|---|---|---|
| esbuild | — | — | — | 0.28.2 | 0.27.2 | 0.25.12 | 0.25.12 | 0.21.5 | 0.21.5 |
| picomatch | 4.0.7 | 4.0.7 | 4.0.5 | 4.0.5 | 4.0.3 | 4.0.5 | — | — | — |
| postcss | 8.5.28 | 8.5.28 | 8.5.26 | 8.5.26 | 8.5.6 | 8.5.26 | 8.5.28 | 8.5.25 | 8.5.28 |
| rolldown | 1.2.8 | 1.2.7 | 1.2.4 | — | — | — | — | — | — |
| rollup | — | — | — | 4.63.3 | 4.54.0 | 4.63.3 | 4.62.4 | 4.62.3 | 4.63.1 |
| tinyglobby | 0.2.17 | 0.2.17 | 0.2.17 | 0.2.17 | 0.2.15 | 0.2.17 | — | — | — |
| fdir | — | — | — | 6.5.0 | 6.5.0 | 6.5.0 | — | — | — |
| lightningcss | 1.33.0 | 1.33.0 | 1.33.0 | — | — | — | — | — | — |
| vitest | — | — | 4.1.10 | — | — | — | — | — | — |
Moved: 6 · unchanged at every release: 3
An edge records that a resolver placed one release beside another on a real machine. It is not a claim that the two work together; that question is answered by samples and contracts, not by presence here.
Recent failure clusters
-
observed UNKNOWN exit 1 ERR_ASSERTION Evidence gap ×4 6.4.3 → 8.2.2 executionContext=node · os=linux · runtime=node@22.23 sha256:986d98189e70…node:internal/modules/run_main:<n> · triggerUncaughtException( · ^ · AssertionError [ERR_ASSERTION]: Expected values to be strictly equal:node · unclassified-diagnostic · outer node · gap stage-unknownEvidence quality: complete · Environment variants: 2 · First recorded: 2026-09-04 · Last seen: 2026-09-05Diagnostic re-verification candidate
-
observed PROJECT_TEST exit 1 ERR_LOAD_URL ×1 8.2.2 executionContext=node · moduleSystem=esm · os=linux · runtime=node@22.23 sha256:a60e7101af87…Contract test failed: Error: Failed to load custom Reporter from basic · at loadCustomReporterModule (fil<path>:<n>:<n>) · at fil<path>:<n>:<n> …javascript/test-runner · test-runner-diagnostic · outer npm testEvidence quality: complete · Environment variants: 1 · First recorded: 2026-08-31 · Last seen: 2026-08-31
-
observed UNKNOWN exit 1 Evidence gap ×1 8.2.2 executionContext=node · moduleSystem=esm · os=linux · runtime=node@22.23 sha256:0ce61af3f1a8…<url>]:<n> · const res = await babelPlugin.transform.handler(code, <str>); · ^ · TypeError: Cannot read properties of undefined (reading <str>)node · unclassified-diagnostic · outer node · gap stage-unknownEvidence quality: complete · Environment variants: 1 · First recorded: 2026-09-01 · Last seen: 2026-09-01Diagnostic re-verification candidate
-
observed UNKNOWN exit 1 Evidence gap ×1 8.2.2 executionContext=node · moduleSystem=esm · os=linux · runtime=node@22.23 sha256:249ecd4b894f…fil<path>:<n> · skipFastRefresh = isProduction || config.command === <str> || config.server.hmr === false; · ^ …node · unclassified-diagnostic · outer node · gap stage-unknownEvidence quality: complete · Environment variants: 1 · First recorded: 2026-09-01 · Last seen: 2026-09-01Diagnostic re-verification candidate
-
observed UNKNOWN exit 1 Evidence gap ×1 8.2.2 executionContext=node · moduleSystem=esm · os=linux · runtime=node@22.23 sha256:8a6df6b44383…fil<path>:<n> · if (config.experimental.bundledDev) isBundledDev = true; · ^ · TypeError: Cannot read properties of undefined (reading <str>)node · unclassified-diagnostic · outer node · gap stage-unknownEvidence quality: complete · Environment variants: 1 · First recorded: 2026-09-01 · Last seen: 2026-09-01Diagnostic re-verification candidate
-
observed UNKNOWN exit 1 ERR_ASSERTION Evidence gap ×1 8.2.2 executionContext=node · moduleSystem=esm · os=linux · runtime=node@22.23 sha256:8b0e67a45c04…node:internal/modules/run_main:<n> · triggerUncaughtException( · ^ · AssertionError [ERR_ASSERTION]: resolves <path> to virtual module IDnode · unclassified-diagnostic · outer node · gap stage-unknownEvidence quality: complete · Environment variants: 1 · First recorded: 2026-09-01 · Last seen: 2026-09-01Diagnostic re-verification candidate
-
observed UNKNOWN exit 1 ERR_ASSERTION Evidence gap ×1 8.2.2 executionContext=node · moduleSystem=esm · os=linux · runtime=node@22.23 sha256:9088da2c451a…node:internal/modules/run_main:<n> · triggerUncaughtException( · ^ · AssertionError [ERR_ASSERTION]: load code contains RefreshRuntimenode · unclassified-diagnostic · outer node · gap stage-unknownEvidence quality: complete · Environment variants: 1 · First recorded: 2026-09-01 · Last seen: 2026-09-01Diagnostic re-verification candidate
-
observed UNKNOWN exit 1 Evidence gap ×1 8.2.2 executionContext=node · moduleSystem=esm · os=linux · runtime=node@22.23 sha256:aaa882de0091…fil<path>:<n> · const hooks = config.plugins.map((plugin) => plugin.api?.reactBabel).filter(defined); · ^ …node · unclassified-diagnostic · outer node · gap stage-unknownEvidence quality: complete · Environment variants: 1 · First recorded: 2026-09-01 · Last seen: 2026-09-01Diagnostic re-verification candidate
-
observed UNKNOWN exit 1 ERR_PACKAGE_PATH_NOT_EXPORTED Evidence gap ×1 8.2.2 executionContext=node · moduleSystem=esm · os=linux · runtime=node@22.23 sha256:b9a7518ba7bb…node:internal/modules/esm/resolve:<n> · return new ERR_PACKAGE_PATH_NOT_EXPORTED( · ^ …node · unclassified-diagnostic · outer node · gap stage-unknownEvidence quality: complete · Environment variants: 1 · First recorded: 2026-09-01 · Last seen: 2026-09-01Diagnostic re-verification candidate
-
observed UNKNOWN exit 1 ERR_PACKAGE_PATH_NOT_EXPORTED Evidence gap ×1 8.2.2 executionContext=node · moduleSystem=cjs · os=linux · runtime=node@22.23 sha256:e72340c7e3d4…node:internal/modules/cjs/loader:<n> · throw e; · ^ · Error [ERR_PACKAGE_PATH_NOT_EXPORTED]: Package subpath <str> is not defined by <str> in <path>node · unclassified-diagnostic · outer node · gap stage-unknownEvidence quality: complete · Environment variants: 1 · First recorded: 2026-09-04 · Last seen: 2026-09-04Diagnostic re-verification candidate