记录npmvite8.2.2
更改条件
依赖健康度
此版本的依赖组合与失败观测
观测到问题 1 项 ·
变动 6 项 ·
正常 1 项
| 库 | 版本 | 健康状态 | 在那里测得 | 项目 |
|---|---|---|---|---|
| picomatch | 4.0.7 | CANDIDATE 相关变更;组合未证实 | 契约通过 | 5 个项目日 |
| postcss | 8.5.26 | CANDIDATE 相关变更;组合未证实 | 契约通过 | 4 个项目日 |
| postcss | 8.5.28 | CANDIDATE 相关变更;组合未证实 | 契约通过 | 1 个项目日 |
| rolldown | 1.2.6 | CANDIDATE 相关变更;组合未证实 | 契约通过 | 3 个项目日 |
| rolldown | 1.2.7 | CANDIDATE 相关变更;组合未证实 | 契约通过 | 1 个项目日 |
| tinyglobby | 0.2.17 | CANDIDATE 相关变更;组合未证实 | 契约通过 | 4 个项目日 |
| lightningcss | 1.33.0 | PASS 所有观测均通过 | 契约通过 | 5 个项目日 |
测量列说的是每个依赖自身版本的情况,而不是这一对的情况。解析器把两个版本放在一起,并不证明它们能协同工作。
各版本的依赖版本
本包的每个版本把子依赖解析到了哪个版本。版本发生变动的子依赖排在最前:升级正是在那里改变了你脚下的东西。
| 库 | 8.3.0 | 8.2.2 | 8.2.1 | 7.3.6 | 7.3.1 | 6.4.3 | 6.2.0 | 5.4.21 | 5.4.14 |
|---|---|---|---|---|---|---|---|---|---|
| esbuild | — | — | — | 0.28.2 | 0.27.2 | 0.25.12 | 0.25.12 | 0.21.5 | 0.21.5 |
| picomatch | 4.0.7 | 4.0.7 | 4.0.5 | 4.0.5 | 4.0.3 | 4.0.5 | — | — | — |
| postcss | 8.5.28 | 8.5.28 | 8.5.26 | 8.5.26 | 8.5.6 | 8.5.26 | 8.5.28 | 8.5.25 | 8.5.28 |
| rolldown | 1.2.8 | 1.2.7 | 1.2.4 | — | — | — | — | — | — |
| rollup | — | — | — | 4.63.3 | 4.54.0 | 4.63.3 | 4.62.4 | 4.62.3 | 4.63.1 |
| tinyglobby | 0.2.17 | 0.2.17 | 0.2.17 | 0.2.17 | 0.2.15 | 0.2.17 | — | — | — |
| fdir | — | — | — | 6.5.0 | 6.5.0 | 6.5.0 | — | — | — |
| lightningcss | 1.33.0 | 1.33.0 | 1.33.0 | — | — | — | — | — | — |
| vitest | — | — | 4.1.10 | — | — | — | — | — | — |
发生变动:6 · 所有版本相同:3
一条边记录的是解析器在真实机器上把一个版本放在了另一个版本旁边。它并不主张两者能协同工作;那个问题由样本和契约回答,而不是由这里存在一行来回答。
近期失败聚类
-
已观测 UNKNOWN exit 1 ERR_ASSERTION 证据缺口 ×4 6.4.3 → 8.2.2 executionContext=node · os=linux · runtime=node@22.23 sha256:986d98189e70…node:internal/modules/run_main:<n> · triggerUncaughtException( · ^ · AssertionError [ERR_ASSERTION]: Expected values to be strictly equal:node · unclassified-diagnostic · outer node · gap stage-unknown证据质量: complete · 环境变体: 2 · 首次记录: 2026-09-04 · 最近观测: 2026-09-05诊断复验候选
-
已观测 PROJECT_TEST exit 1 ERR_LOAD_URL ×1 8.2.2 executionContext=node · moduleSystem=esm · os=linux · runtime=node@22.23 sha256:a60e7101af87…Contract test failed: Error: Failed to load custom Reporter from basic · at loadCustomReporterModule (fil<path>:<n>:<n>) · at fil<path>:<n>:<n> …javascript/test-runner · test-runner-diagnostic · outer npm test证据质量: complete · 环境变体: 1 · 首次记录: 2026-08-31 · 最近观测: 2026-08-31
-
已观测 UNKNOWN exit 1 证据缺口 ×1 8.2.2 executionContext=node · moduleSystem=esm · os=linux · runtime=node@22.23 sha256:0ce61af3f1a8…<url>]:<n> · const res = await babelPlugin.transform.handler(code, <str>); · ^ · TypeError: Cannot read properties of undefined (reading <str>)node · unclassified-diagnostic · outer node · gap stage-unknown证据质量: complete · 环境变体: 1 · 首次记录: 2026-09-01 · 最近观测: 2026-09-01诊断复验候选
-
已观测 UNKNOWN exit 1 证据缺口 ×1 8.2.2 executionContext=node · moduleSystem=esm · os=linux · runtime=node@22.23 sha256:249ecd4b894f…fil<path>:<n> · skipFastRefresh = isProduction || config.command === <str> || config.server.hmr === false; · ^ …node · unclassified-diagnostic · outer node · gap stage-unknown证据质量: complete · 环境变体: 1 · 首次记录: 2026-09-01 · 最近观测: 2026-09-01诊断复验候选
-
已观测 UNKNOWN exit 1 证据缺口 ×1 8.2.2 executionContext=node · moduleSystem=esm · os=linux · runtime=node@22.23 sha256:8a6df6b44383…fil<path>:<n> · if (config.experimental.bundledDev) isBundledDev = true; · ^ · TypeError: Cannot read properties of undefined (reading <str>)node · unclassified-diagnostic · outer node · gap stage-unknown证据质量: complete · 环境变体: 1 · 首次记录: 2026-09-01 · 最近观测: 2026-09-01诊断复验候选
-
已观测 UNKNOWN exit 1 ERR_ASSERTION 证据缺口 ×1 8.2.2 executionContext=node · moduleSystem=esm · os=linux · runtime=node@22.23 sha256:8b0e67a45c04…node:internal/modules/run_main:<n> · triggerUncaughtException( · ^ · AssertionError [ERR_ASSERTION]: resolves <path> to virtual module IDnode · unclassified-diagnostic · outer node · gap stage-unknown证据质量: complete · 环境变体: 1 · 首次记录: 2026-09-01 · 最近观测: 2026-09-01诊断复验候选
-
已观测 UNKNOWN exit 1 ERR_ASSERTION 证据缺口 ×1 8.2.2 executionContext=node · moduleSystem=esm · os=linux · runtime=node@22.23 sha256:9088da2c451a…node:internal/modules/run_main:<n> · triggerUncaughtException( · ^ · AssertionError [ERR_ASSERTION]: load code contains RefreshRuntimenode · unclassified-diagnostic · outer node · gap stage-unknown证据质量: complete · 环境变体: 1 · 首次记录: 2026-09-01 · 最近观测: 2026-09-01诊断复验候选
-
已观测 UNKNOWN exit 1 证据缺口 ×1 8.2.2 executionContext=node · moduleSystem=esm · os=linux · runtime=node@22.23 sha256:aaa882de0091…fil<path>:<n> · const hooks = config.plugins.map((plugin) => plugin.api?.reactBabel).filter(defined); · ^ …node · unclassified-diagnostic · outer node · gap stage-unknown证据质量: complete · 环境变体: 1 · 首次记录: 2026-09-01 · 最近观测: 2026-09-01诊断复验候选
-
已观测 UNKNOWN exit 1 ERR_PACKAGE_PATH_NOT_EXPORTED 证据缺口 ×1 8.2.2 executionContext=node · moduleSystem=esm · os=linux · runtime=node@22.23 sha256:b9a7518ba7bb…node:internal/modules/esm/resolve:<n> · return new ERR_PACKAGE_PATH_NOT_EXPORTED( · ^ …node · unclassified-diagnostic · outer node · gap stage-unknown证据质量: complete · 环境变体: 1 · 首次记录: 2026-09-01 · 最近观测: 2026-09-01诊断复验候选
-
已观测 UNKNOWN exit 1 ERR_PACKAGE_PATH_NOT_EXPORTED 证据缺口 ×1 8.2.2 executionContext=node · moduleSystem=cjs · os=linux · runtime=node@22.23 sha256:e72340c7e3d4…node:internal/modules/cjs/loader:<n> · throw e; · ^ · Error [ERR_PACKAGE_PATH_NOT_EXPORTED]: Package subpath <str> is not defined by <str> in <path>node · unclassified-diagnostic · outer node · gap stage-unknown证据质量: complete · 环境变体: 1 · 首次记录: 2026-09-04 · 最近观测: 2026-09-04诊断复验候选